{"text_format":"1","workbook":"xlsx","n_sheets":9,"sheets":["Apoio","DESBAN","INPUT","FLUXO","SIMULAÇÃO Prazo Determinado","SIMULAÇÃO Prazo Indeterminado","SIMULAÇÃO Percentual do Saldo","SIMULAÇÃO Renda Vitalícia","CALCULOS"],"not_rendered":{"charts":2,"images":12,"macros":1,"external_links":0,"defined_names":46,"comments":5,"pivot_tables":0},"unopened":[],"bounds":{"document_bytes":16777216,"sheet_cells":100000,"rows_first":2000,"rows_last":500,"rows_between":2000,"halvings":0,"cell_chars":16384,"cell_head_chars":4096},"cells_cut":0,"cells_raw":0,"read":"whole","date_system":"1900"}

{"sheet":"Apoio","index":0,"n_rows":27,"n_cols":7,"rows_kept":27,"cut":false,"hidden":true,"merged":[[2,4,2,6]]}
[]
[null,"Listas Suspensas:"]
[null,"Sexo",null,null,"PREMISSAS DA 2021"]
[null,"Masculino",null,null,"Hipótese","Exer. Seguinte","Valor"]
[null,"Feminino",null,null,"Tábua de Mortalidade Geral",7.0000000000000007E-2,"AT 2012 Basic IAM desagravada em 20%"]
[null,null,null,null,"Tábua de Mortalidade de Inválidos",0.01,"Winklevoss desagravada em 50%"]
[null,"Sim ou Não",null,null,"Tábua de Entrada em Invalidez",0,"Álvaro Vindas desagravada em 70%"]
[null,"Sim",null,null,"Tábua de Morbidez",0.19,"Experiência Rodarte desagravada em 60%"]
[null,"Não"]
[null,null,null,null,"Taxa Real Anual de Juros",4.38,4.38]
[null,"Parcelas ao ano",null,null,"Fator de Determinação Valor Real Longo do Tempo Ben Entidade",98.44,98.44]
[null,12,null,null,"Hipótese sobre Composição de Família de Pensionistas",0,"Família Padrão"]
[null,13,null,null,"Hipótese sobre Rotatividade (Percentual)",2.57,"4,00% para a faixa etária de 16 a 39 anos; 0,30% para as demais faixas etárias."]
[null,null,null,null,"Indexador do Plano (Reajuste dos Benefícios)",0,"IPCA (IBGE)"]
[null,"Tipo Rendas Financeiras",null,null,"Duration (em meses, 179)",14.925800000000001]
[null,"Renda por Prazo Determinado"]
[null,"Renda por Prazo Indeterminado"]
[null,"Renda por Percentual do Saldo da Conta de Benefícios"]
[]
[null,"Tipo Rendas Financeiras e Vitalícia"]
[null,"Renda por Prazo Determinado"]
[null,"Renda por Prazo Indeterminado"]
[null,"Renda por Percentual do Saldo da Conta de Benefícios"]
[null,"Rendas Vitalícia"]
[]
[null,"Nome Curto para Fórmula"]
[null,{"$f":"IF(DESBAN!C9=\"Rendas Financeiras e Vitalícia\",\"RFV\",\"RF\")","v":"RF"}]

{"sheet":"DESBAN","index":1,"n_rows":164,"n_cols":12,"rows_kept":164,"cut":false,"hidden":true,"merged":[[0,1,1,1],[38,1,38,3],[39,1,41,3],[11,2,11,4],[18,2,18,3],[20,1,20,2],[20,3,21,3],[19,2,19,3]]}
[null,"Parâmetros","Legenda"]
[null,null,"Preenchimento de Valores"]
[null,null,"Títulos e Fórmulas"]
[]
[null,"Contribuições",null,null,"Tipos de Renda"]
[null,"Taxa de Carregamento ao mês",0.09,null,"Renda por Prazo Determinado"]
[null,"Contribuição de Risco",3.5000000000000003E-2,null,"Renda por Prazo Indeterminado"]
[null,null,null,null,"Renda por Percentual do Saldo de Contas"]
[]
[]
[null,"Percentuais de Contribuição"]
[null,"Tipo","%"]
[null,"Contribuição Básica",0.03,7.0000000000000007E-2,0.12,"pré-definido de acordo com salário de partic "]
[null,"Contribuição Voluntária",0,0.12,"livre escolha, até 12%"]
[null,"Contribuição Especial",0,"-","livre escolha"]
[]
[]
[null,null,"Participante","Patrocinadora"]
[null,"Cálculo Salário Considerado",{"$f":"IF(IN_SalContrib>C25,C25,IN_SalContrib)","v":0}]
[null,"Cálculo Contribuição",{"$f":"(MIN(MAX(0,PAR_salario_partic-DESBAN!B23),DESBAN!C23-DESBAN!B23)*DESBAN!D23+MIN(MAX(0,PAR_salario_partic-DESBAN!C23),DESBAN!C24-DESBAN!B24)*DESBAN!D24+MIN(MAX(0,PAR_salario_partic-DESBAN!C24),DESBAN!C25-DESBAN!B25)*DESBAN!D25)","v":0}]
[null,"Parcela do SRC",null,"% CN"]
[null,"De","Até"]
[null,0,{"$f":"PAR_UR","v":7531.24},0.03]
[null,{"$f":"PAR_UR+0.01","v":7531.25},{"$f":"3*PAR_UR","v":22593.72},7.0000000000000007E-2]
[null,{"$f":"3*PAR_UR+0.01","v":22593.73},{"$f":"4.5*PAR_UR","v":33890.58},0.12]
[]
[null,"Aposentadoria"]
[null,"Elegibilidade"]
[null,"Tipo","Idade","Tempo de Plano","Tempo na Patrocinadora"]
[null,"Aposentadoria Normal",60,10,0,"(em anos)"]
[null,"Aposentadoria Antecipada",55,10,0,"(em anos)"]
[]
[null,"Taxa de Rentabilidade",4.3799999999999999E-2]
[null,"Taxa de Crescimento Salarial ao ano",5.0000000000000001E-3]
[null,"Qtde parcelas ao ano",{"$f":"PAR_n_benef","v":0},"--> escolha do participante, busca do input"]
[]
[null,"UR (Unidade de Referência)",1,0.1]
[null,"URD",7531.24,{"$f":"PAR_UR*0.1","v":753.12400000000002}]
[]
[null,"Fatores Atuariais para Renda por Prazo Indeterminado"]
[]
[]
[null,"x","M - Sem reversão","F - Sem reversão","M - Com reversão","F - Com reversão","ax(12) M","ax(12) F","axh(12) M","axh(12) F","eox M","eox F"]
[null,0,{"$f":"G44","v":22.541175342427337},{"$f":"H44","v":22.665208973116538},{"$f":"G44+I44","v":22.541175342427337},{"$f":"H44+J44","v":22.792711872253889},22.541175342427337,22.665208973116538,0,0.1275028991373493,85.152923482154307,88.069647900063316]
[null,1,{"$f":"G45","v":22.537721172936653},{"$f":"H45","v":22.667706008753886},{"$f":"G45+I45","v":22.537721172936653},{"$f":"H45+J45","v":22.7804893470562},22.537721172936653,22.667706008753886,0,0.11278333830231327,84.273844894511853,87.196000297291647]
[null,2,22.509501229782632,22.645301809831608,22.509501229782632,22.757626888148415,22.509501229782632,22.645301809831608,0,0.11232507831680831,83.303746071110041,86.227222097246667]
[null,3,22.477464204051969,22.618896588640013,22.477464204051969,22.732708927801294,22.477464204051969,22.618896588640013,0,0.11381233916128254,82.324021391546708,85.246909587688009]
[null,4,22.443062537078216,22.589705027273041,22.443062537078216,22.706129674437413,22.443062537078216,22.589705027273041,0,0.1164246471643722,81.340651411913584,84.260403443916275]
[null,5,22.40603041975773,22.558364187680066,22.669666828117929,22.678081668177466,22.40603041975773,22.558364187680066,0.26363640836020014,0.11971748049739803,80.353135135978576,83.270589947653917]
[null,6,22.367242443305457,22.525407506085042,22.640453772168843,22.648720784231141,22.367242443305457,22.525407506085042,0.27321132886338656,0.12331327814609942,79.365019050813345,82.279795060864686]
[null,7,22.326713055122582,22.490838191926002,22.609764536775554,22.618016143945695,22.326713055122582,22.490838191926002,0.28305148165297361,0.12717795201969204,78.376629690703808,81.288301044173295]
[null,8,22.284274833926975,22.454604284671561,22.577664649138573,22.585916883710507,22.284274833926975,22.454604284671561,0.29338981521159729,0.13131259903894665,77.38765858315918,80.296186752000281]
[null,9,22.239644544512455,22.416468415170439,22.544032631590266,22.552304459447061,22.239644544512455,22.416468415170439,0.30438808707781134,0.13583604427662191,76.397439937519238,79.302890194776637]
[null,10,22.192763459048962,22.376530924357525,22.508819694942051,22.517178174328983,22.192763459048962,22.376530924357525,0.31605623589309084,0.14064724997145894,75.406123598058841,78.309068825772599]
[null,11,22.143515865185396,22.334767936313597,22.471955488185326,22.480491346314324,22.143515865185396,22.334767936313597,0.32843962299992874,0.14572341000072653,74.413674896488402,77.31492050779481]
[null,12,22.092051900965895,22.29120886451398,22.433456732364711,22.442214791603774,22.092051900965895,22.29120886451398,0.34140483139881622,0.15100592708979402,73.420948717842236,76.320820346797433]
[null,13,22.038760653507172,22.24590194802671,22.393422337396302,22.402324600727283,22.038760653507172,22.24590194802671,0.35466168388912933,0.15642265270057229,72.42952523000929,75.327189830743208]
[null,14,21.98386513378226,22.198878611423712,22.351890372510368,22.360789407453833,21.98386513378226,22.198878611423712,0.36802523872810827,0.16191079603012176,71.440345057906001,74.334373930640552]
[null,15,21.927416589725098,22.150261393741079,22.308840940450992,22.317609279096509,21.927416589725098,22.150261393741079,0.38142435072589437,0.16734788535542841,70.453741124230248,73.34299879289955]
[null,16,21.869306550619697,22.100014341187673,22.264195317652028,22.272725815697274,21.869306550619697,22.100014341187673,0.39488876703233239,0.17271147450960214,69.4695262493521,72.353139949980587]
[null,17,21.809404036079712,22.04800949945427,22.217865751031987,22.226045813689343,21.809404036079712,22.04800949945427,0.40846171495227351,0.17803631423507163,68.487462989729451,71.36458079124256]
[null,18,21.747554759511633,21.994095584324626,22.169754762803802,22.177465191385007,21.747554759511633,21.994095584324626,0.42220000329216784,0.18336960706038211,67.507266705794166,70.377055152949481]
[null,19,21.683598036764334,21.938061297965092,22.11976061616939,22.12685630221462,21.683598036764334,21.938061297965092,0.43616257940505837,0.18879500424952775,66.5286622547859,69.390138586892945]
[null,20,21.617366525068391,21.879758434170814,22.067778547828425,22.074111695915629,21.617366525068391,21.879758434170814,0.45041202276003461,0.19435326174481432,65.551383930858108,68.403643701058357]
[null,21,21.548721190609545,21.819032623940334,22.01370988924765,22.019119421117487,21.548721190609545,21.819032623940334,0.46498869863810427,0.20008679717715322,64.575279573517506,67.417390180830949]
[null,22,21.477622383282565,21.755758655841774,21.957488188257802,21.961775843190967,21.477622383282565,21.755758655841774,0.47986580497523768,0.20601718734919261,63.600509534070106,66.431311893704844]
[null,23,21.403975312447198,21.689805915433954,21.899024864907975,21.901969802339028,21.403975312447198,21.689805915433954,0.49504955246077692,0.21216388690507537,62.627073406559575,65.445345063134283]
[null,24,21.327820146751318,21.621055830645219,21.838276806822527,21.839592920470945,21.327820146751318,21.621055830645219,0.51045666007121093,0.21853708982572737,61.655366529403757,64.45948024603581]
[null,25,21.249110028494293,21.549331720673468,21.775168549974204,21.774512656067149,21.249110028494293,21.549331720673468,0.52605852147990917,0.22518093539368128,60.685518753045272,63.473554428009976]
[null,26,21.167829609143638,21.474484732390987,21.709633822956434,21.706604140089119,21.167829609143638,21.474484732390987,0.54180421381279542,0.2321194076981325,59.717747291395632,62.487512460771285]
[null,27,21.083961360415696,21.396464583999371,21.641604033022123,21.635776495916751,21.083961360415696,21.396464583999371,0.55764267260642741,0.23931191191738044,58.752255805176567,61.501599224115004]
[null,28,20.996987151297539,21.315113217231794,21.570825358379093,21.561895017527711,20.996987151297539,21.315113217231794,0.57383820708155531,0.24678180029591712,57.787881358262752,60.51575487924697]
[null,29,20.906575656030313,21.230352563308365,21.497108597584258,21.484851266176612,20.906575656030313,21.230352563308365,0.5905329415539462,0.25449870286824561,56.824064307653735,59.530162118155324]
[null,30,20.812468163456771,21.142082927376851,21.420286582886906,21.404525884486226,20.812468163456771,21.142082927376851,0.60781841943013626,0.26244295710937438,55.860495732094961,58.544946972877334]
[null,31,20.71444650630302,21.050268344093567,21.340204315369729,21.320822701400356,20.71444650630302,21.050268344093567,0.62575780906670897,0.27055435730678934,54.897013443356826,57.560414267238137]
[null,32,20.612232744053941,20.954818125225611,21.256683533214957,21.233623408404689,20.612232744053941,20.954818125225611,0.6444507891610155,0.27880528317908015,53.933331362041564,56.576715377149839]
[null,33,20.50553793994473,20.855465834451003,21.169535916687082,21.142739303915654,20.50553793994473,20.855465834451003,0.66399797674235106,0.28727346946465177,52.969177098368313,55.593543440181904]
[null,34,20.393928203880442,20.751985479741606,21.078516815738286,21.047993390172987,20.393928203880442,20.751985479741606,0.68458861185784459,0.29600791043138297,52.003955718636341,54.610737990434927]
[null,35,20.27702063962332,20.644192371060633,20.983395752775454,20.949220670002024,20.27702063962332,20.644192371060633,0.70637511315213453,0.30502829894139,51.037269409582684,53.628275551713678]
[null,36,20.15459996408801,20.531960723498035,20.884003269502763,20.846276277139609,20.15459996408801,20.531960723498035,0.72940330541475396,0.31431555364157254,50.069188681478451,52.646302777615823]
[null,37,20.026638130657044,20.415157915542821,20.780236728676805,20.73900850347799,20.026638130657044,20.415157915542821,0.75359859801976159,0.3238505879351703,49.100258283267088,51.664956966226939]
[null,38,19.893264904661461,20.293677317617306,20.672046853047437,20.627272989741382,19.893264904661461,20.293677317617306,0.77878194838597525,0.33359567212407776,48.131382367982589,50.684448004026869]
[null,39,19.75455967721707,20.167455048085966,20.559364641881825,20.510938201191934,19.75455967721707,20.167455048085966,0.80480496466475482,0.34348315310596844,47.163297712130628,49.705092337996241]
[null,40,19.610517877835139,20.036404828256863,20.442088237403425,20.38986174343022,19.610517877835139,20.036404828256863,0.83157035956828462,0.35345691517335776,46.196508268811414,48.727146099448788]
[null,41,19.461112922855133,19.900417204813223,20.320107428140012,20.263890031101489,19.461112922855133,19.900417204813223,0.85899450528487886,0.36347282628826749,45.231447094391527,47.750808295837068]
[null,42,19.3062161835851,19.759277823072182,20.193269961758418,20.132825745118822,19.3062161835851,19.759277823072182,0.88705377817331943,0.37354792204664056,44.268300359247263,46.776034787999947]
[null,43,19.145673622258638,19.612777875328103,20.061412327808064,19.996475681987004,19.145673622258638,19.612777875328103,0.91573870554942727,0.38369780665890213,43.307201153871901,45.802816336969236]
[null,44,18.97916479401151,19.460586190858724,19.924303785695429,19.854591154911347,18.97916479401151,19.460586190858724,0.94513899168391768,0.39400496405262342,42.347923820671078,44.83088522109815]
[null,45,18.806432128581864,19.302405471437414,19.781734974779685,19.706931851617437,18.806432128581864,19.302405471437414,0.97530284619782082,0.40452638018002235,41.390417460142636,43.860091905608797]
[null,46,18.627280911673818,19.137862461162225,19.633518813267528,19.553219525694349,18.627280911673818,19.137862461162225,1.0062379015937117,0.41535706453212545,40.434790773340943,42.890152603332396]
[null,47,18.441730462356976,18.966786788241407,19.479550419454807,19.393260275941813,18.441730462356976,18.966786788241407,1.0378199570978301,0.42647348770040622,39.481617243456476,41.921272849094485]
[null,48,18.250089322239891,18.789104303139506,19.319846937194352,19.226897033717066,18.250089322239891,18.789104303139506,1.0697576149544616,0.43779273057756046,38.532046647725345,40.953872174172254]
[null,49,18.052658459744475,18.604852248717922,19.154421719543507,19.054021347516716,18.052658459744475,18.604852248717922,1.1017632597990306,0.44916909879879297,37.587135881063709,39.988595193410127]
[null,50,17.849568483909046,18.413816065188254,18.983222941867925,18.874410783436627,17.849568483909046,18.413816065188254,1.1336544579588783,0.46059471824837445,36.647522894280648,39.025527846630006]
[null,51,17.640908767233899,18.216051041296133,18.806181718211544,18.687975987937538,17.640908767233899,18.216051041296133,1.1652729509776441,0.47192494664140527,35.713721577324002,38.065327264366843]
[null,52,17.426611415325674,18.011822613362654,18.623176905512867,18.494742539028465,17.426611415325674,18.011822613362654,1.1965654901871934,0.48291992566581149,34.785902419312947,37.109044017132355]
[null,53,17.20630851607298,17.800873415454856,18.433965146322326,18.294493454965998,17.20630851607298,17.800873415454856,1.2276566302493452,0.49362003951114297,33.863646733683233,36.156609633793167]
[null,54,16.9794717929984,17.582856352327756,18.238239613855445,18.086974347090496,16.9794717929984,17.582856352327756,1.2587678208570465,0.50411799476274144,32.946272405032616,35.207800336355376]
[null,55,16.745660719899323,17.357533673524856,18.035717571055287,17.871987025691176,16.745660719899323,17.357533673524856,1.2900568511559634,0.51445335216631916,32.033331600395279,34.262641880185555]
[null,56,16.504642988740795,17.12470459426746,17.826232325915587,17.649355449755461,16.504642988740795,17.12470459426746,1.3215893371747924,0.52465085548800083,31.124815867737478,33.321247337572103]
[null,57,16.256444350253101,16.88441202339175,17.609762829877237,17.419042841008054,16.256444350253101,16.88441202339175,1.3533184796241351,0.53463081761630182,30.221206725960847,32.384200851682557]
[null,58,16.001184536869435,16.636855947052268,17.386312964206649,17.181105587898969,16.001184536869435,16.636855947052268,1.3851284273372135,0.54424964084670058,29.323130255923488,31.452348821248517]
[null,59,15.739151180666989,16.382416112407039,17.155981147251293,16.935718951914364,15.739151180666989,16.382416112407039,1.4168299665843052,0.5533028395073244,28.431472835397486,30.526813172863388]
[null,60,15.470563421501508,16.121420489118428,16.918867054742652,16.683064031105523,15.470563421501508,16.121420489118428,1.4483036332411454,0.56164354198709465,27.546936463430129,29.608539793278261]
[null,61,15.195544504634938,15.854156105839534,16.675054537013882,16.423337963286507,15.195544504634938,15.854156105839534,1.4795100323789447,0.56918185744697358,26.670005721345539,28.698330499229499]
[null,62,14.91428082029516,15.580866593965196,16.424713263656276,16.156568765542126,14.91428082029516,15.580866593965196,1.510432443361118,0.5757021715769316,25.801238380368229,27.796848808039577]
[null,63,14.626712895249684,15.301534409600277,16.167936764696002,15.882831659408307,14.626712895249684,15.301534409600277,1.5412238694463167,0.58129724980802933,24.940735018622338,26.904251550717156]
[null,64,14.332703997719207,15.016069616896843,15.904273511564638,15.601787118820267,14.332703997719207,15.016069616896843,1.5715695138454311,0.58571750192342376,24.088462501330326,26.020560119175808]
[null,65,{"$f":"G109","v":14.032247699827449},{"$f":"H109","v":14.724552088698836},{"$f":"G109+I109","v":15.633256580487375},{"$f":"H109+J109","v":15.313144405766248},14.032247699827449,14.724552088698836,1.6010088806599252,0.58859231706741288,23.244607037207004,25.146082304406502]
[null,66,13.725549997727088,14.427282654974602,15.354942823255106,15.01705845759937,13.725549997727088,14.427282654974602,1.6293928255280183,0.58977580262476803,22.409685063903467,24.281468422693358]
[null,67,13.408574066909004,14.120568510830218,15.067086103627146,14.711206813664656,13.408574066909004,14.120568510830218,1.6585120367181414,0.59063830283443919,21.577420473694406,23.420763814538176]
[null,68,13.081603586060034,13.804769361444604,14.76975834013602,14.395804126105149,13.081603586060034,13.804769361444604,1.6881547540759869,0.59103476466054583,20.748856245886213,22.565077390756663]
[null,69,12.745016036323397,13.480405811577,14.46308084896104,14.071187952373572,12.745016036323397,13.480405811577,1.7180648126376419,0.5907821407965711,19.925116834117919,21.715699835642312]
[null,70,12.399328413563966,13.147847149187706,14.147277250270802,13.737618572587939,12.399328413563966,13.147847149187706,1.7479488367068368,0.58977142340023347,19.107466270432941,20.873590825790593]
[null,71,12.045155657317714,12.807221879172282,13.822659975954469,13.395216456911172,12.045155657317714,12.807221879172282,1.7775043186367556,0.58799457773888952,18.297228047013149,20.039268783505864]
[null,72,11.683277330698745,12.458459785312973,13.489149010676444,13.043988038471346,11.683277330698745,12.458459785312973,1.805871679977699,0.58552825315837242,17.495873699255007,19.21291591723763]
[null,73,11.314647357658373,12.101523653927517,13.147256947870968,12.683984388322516,11.314647357658373,12.101523653927517,1.8326095902125947,0.58246073439499924,16.705017896808613,18.394759078610175]
[null,74,10.940278698378028,11.736413407519089,12.79756821199793,12.315306216264213,10.940278698378028,11.736413407519089,1.8572895136199017,0.57889280874512328,15.92623326544096,17.585071907305124]
[null,75,10.561162465432185,11.363320011569028,12.440654866035242,11.938209198065621,10.561162465432185,11.363320011569028,1.879492400603058,0.5748891864965926,15.160934291101119,16.784395556866915]
[null,76,10.178200945579333,10.982816247478477,12.077025354370104,11.553273577534044,10.178200945579333,10.982816247478477,1.8988244087907715,0.57045733005556842,14.410294048772796,15.993787487781798]
[null,77,9.7922201620232361,10.595653683662015,11.707135484574632,11.161307256400246,9.7922201620232361,10.595653683662015,1.9149153225513955,0.56565357273823147,13.675281083230269,15.214481668331839]
[null,78,9.4040987831309852,10.202617136442957,11.3314955509602,10.763052439947877,9.4040987831309852,10.202617136442957,1.9273967678292148,0.56043530350492166,12.95685225991677,14.447665246172123]
[null,79,9.0147381197087117,9.8047155549152833,10.950658219418894,10.359440430663549,9.0147381197087117,9.8047155549152833,1.9359200997101831,0.55472487574826446,12.255912067148657,13.694744649438103]
[null,80,8.6250306895100106,9.403360027883835,10.565230924026121,9.9517921978738251,8.6250306895100106,9.403360027883835,1.9402002345161113,0.54843216998999034,11.573275003192579,12.957565521037761]
[null,81,8.2363799160835676,9.0005506738245753,10.176210392558101,9.5419843063837124,8.2363799160835676,9.0005506738245753,1.9398304764745335,0.54143363255913735,10.910355150918967,12.238620247277492]
[null,82,7.8511220903625931,8.5997102327452684,9.7851991066117208,9.1330302735345796,7.8511220903625931,8.5997102327452684,1.934077016249127,0.53332004078931194,10.26965674718112,11.542090563141098]
[null,83,7.4696417822829524,8.2033898211418954,9.3927385879263277,8.7274071371162538,7.4696417822829524,8.2033898211418954,1.9230968056433757,0.5240173159743583,9.6509845732666193,10.870675804262353]
[null,84,7.0921034668255869,7.8139488728331452,8.9993367196612741,8.3274756288572984,7.0921034668255869,7.8139488728331452,1.9072332528356879,0.51352675602415276,9.0538753169317587,10.22660160818449]
[null,85,6.7193371500855443,7.4334789540890513,8.6060231162635539,7.9353643710100226,6.7193371500855443,7.4334789540890513,1.8866859661780091,0.50188541692097133,8.4787346758158861,9.6115608641559476]
[null,86,6.3530973519295983,7.0635720772398267,8.2145511993839335,7.5527458323779468,6.3530973519295983,7.0635720772398267,1.8614538474543347,0.48917375513811989,7.9270895481348527,9.0264650930610202]
[null,87,5.9958672894130309,6.7051015243239993,7.82746340953911,7.1805295340766442,5.9958672894130309,6.7051015243239993,1.8315961201260789,0.47542800975264488,7.4012599609089182,8.4712375182455926]
[null,88,5.650330643227683,6.358478701904712,7.4473032521874334,6.8192815717914028,5.650330643227683,6.358478701904712,1.7969726089597506,0.460802869886691,6.9036605177892678,7.9452168698489958]
[null,89,5.3189502346902744,6.0236836103585416,7.0764832975249741,6.4691642925474913,5.3189502346902744,6.0236836103585416,1.7575330628346999,0.44548068218894926,6.4362959058837141,7.4472476850101605]
[null,90,5.0036616588772249,5.700105532009065,6.7170539638175262,6.1298060994327388,5.0036616588772249,5.700105532009065,1.7133923049403015,0.42970056742367363,6.00044053826102,6.9755347555426539]
[null,91,4.7056975450218994,5.3864602803345987,6.3705075251465662,5.8001733526567998,4.7056975450218994,5.3864602803345987,1.6648099801246667,0.41371307232220139,5.5965029472136347,6.5276066692206181]
[null,92,4.424464118537462,5.0800507241711088,6.0370179203896495,5.4754086459902389,4.424464118537462,5.0800507241711088,1.6125538018521874,0.39535792181913032,5.222801797714018,6.0995096130742539]
[null,93,4.1600012457961553,4.7799514969525774,5.7169649549223411,5.1566264388992176,4.1600012457961553,4.7799514969525774,1.5569637091261863,0.37667494194664008,4.8785993572674373,5.6896999822630265]
[null,94,3.9124777974726466,4.4870844710089521,5.4106056752637031,4.8439604646846126,3.9124777974726466,4.4870844710089521,1.4981278777910565,0.35687599367566081,4.5635006009539048,5.2989828758796476]
[null,95,3.6824659616407689,4.2049914919698015,5.1181615933509663,4.5392249398283147,3.6824659616407689,4.2049914919698015,1.4356956317101974,0.33423344785851311,4.2778099431976333,4.9312744695458779]
[null,96,3.4709250333462784,3.9407280565909066,4.839723950931841,4.2465212272639592,3.4709250333462784,3.9407280565909066,1.3687989175855628,0.30579317067305245,4.0225640890796424,4.5944589028126641]
[null,97,3.2547674349188624,3.6983600325974741,4.5602115717484475,3.9682599782417394,3.2547674349188624,3.6983600325974741,1.305444136829585,0.26989994564426517,3.7718334182384652,4.2927422823873744]
[null,98,3.0478330231242929,3.467312178102679,4.2881421980335768,3.6918100480005251,3.0478330231242929,3.467312178102679,1.2403091749092836,0.22449786989784595,3.5437416429679622,4.0137120996023352]
[null,99,2.8462510965144134,3.2454671865028537,4.0212465662894177,3.4133001988134892,2.8462510965144134,3.2454671865028537,1.174995469775004,0.16783301231063533,3.3366787915099372,3.7557270496533306]
[null,100,2.6442312905902372,3.02962461311748,3.7566597223781626,3.1314649938589181,2.6442312905902372,3.02962461311748,1.1124284317879252,0.10184038074143822,3.1488143824456558,3.5167739660299122]
[null,101,2.4343559913980459,2.8156465672503299,3.4912262108018659,2.8567743945574615,2.4343559913980459,2.8156465672503299,1.05687021940382,4.1127827307131465E-2,2.979612145742589,3.2950928628666336]
[null,102,2.2189283870502496,2.6211376754717501,3.2264728742221931,2.6652075810664568,2.2189283870502496,2.6211376754717501,1.0075444871719434,4.4069905594706624E-2,2.8457994820520902,3.1160974029994803]
[null,103,1.9709078603223427,2.4220287423855607,2.9415128274876907,2.4690632731525226,1.9709078603223427,2.4220287423855607,0.97060496716534805,4.7034530766961978E-2,2.7371607618881182,2.9594066478956065]
[null,104,1.6630765661762197,2.2080726327359197,2.6198894209515453,2.2580857082628136,1.6630765661762197,2.2080726327359197,0.95681285477532574,5.0013075526893776E-2,2.65852177951081,2.8264677697004248]
[null,105,1.2499769694424572,1.9628100370024908,2.2391495097185499,2.0159009675989377,1.2499769694424572,1.9628100370024908,0.98917254027609258,5.3090930596446748E-2,2.6184688053846754,2.7202421003666761]
[null,106,0.64783740133824175,1.659214785777426,1.7698346744531417,1.7162681488267406,0.64783740133824175,1.659214785777426,1.1219972731148999,5.705336304931468E-2,2.6153953020362879,2.6462377655399774]
[null,107,0.64783740133824164,1.2499769694424567,1.6757945478207352,1.3188845444344492,0.64783740133824164,1.2499769694424567,1.0279571464824937,6.8907574991992571E-2,2.6108754441710111,2.6108754441710107]
[null,108,0.64783740133824164,0.64783740133824175,1.5794833546605469,0.79627111639626391,0.64783740133824164,0.64783740133824175,0.93164595332230538,0.14843371505802214,2.6042285943691339,2.6042285943691339]
[null,109,0.64783740133824141,0.64783740133824153,1.4757832296428117,0.79627111639609871,0.64783740133824141,0.64783740133824153,0.8279458283045702,0.14843371505785716,2.5944538152487269,2.5944538152487273]
[null,110,0.64783740133824108,0.64783740133824119,1.3565729327143297,0.79627111639523651,0.64783740133824108,0.64783740133824119,0.70873553137608869,0.14843371505699526,2.5800791400716583,2.5800791400716587]
[null,111,0.64783740133823886,0.64783740133823886,1.2091635282689324,0.79627111639073611,0.64783740133823886,0.64783740133823886,0.56132612693069339,0.14843371505249719,2.5589399118700866,2.5589399118700862]
[null,112,0.64783740133822665,0.64783740133822676,1.0169717649869885,0.79627111636724812,0.64783740133822665,0.64783740133822676,0.36913436364876179,0.14843371502902139,2.5278528115736574,2.5278528115736569]
[null,113,0.64783740133816314,0.64783740133816337,0.79627111639622461,0.79627111624466507,0.64783740133816314,0.64783740133816337,0.14843371505806147,0.14843371490650167,2.4821364876083196,2.4821364876083196]
[null,114,0.64783740133783196,0.64783740133783196,0.79627111639589332,0.79627111560490382,0.64783740133783196,0.64783740133783196,0.14843371505806136,0.14843371426707183,2.414906599424,2.4149065994239995]
[null,115,0.64783740133610335,0.64783740133610335,0.79627111639416459,0.79627111226599034,0.64783740133610335,0.64783740133610335,0.14843371505806122,0.14843371092988697,2.3160391167999994,2.3160391167999999]
[null,116,0.6478374013270819,0.6478374013270819,0.79627111638514181,0.79627109484020264,0.6478374013270819,0.6478374013270819,0.14843371505805994,0.14843369351312077,2.1706457599999993,2.1706457599999993]
[null,117,0.64783740127999867,0.64783740127999867,0.7962711163380527,0.79627100389504046,0.64783740127999867,0.64783740127999867,0.14843371505805408,0.14843360261504179,1.9568319999999995,1.9568319999999999]
[null,118,0.64783740103427145,0.64783740103427145,0.79627111609229362,0.79627052925286346,0.64783740103427145,0.64783740103427145,0.14843371505802219,0.148433128218592,1.6423999999999999,1.6423999999999999]
[null,119,0.64783739975182064,0.64783739975182075,0.79627111480967772,0.79626805211164131,0.64783739975182064,0.64783739975182075,0.14843371505785713,0.14843065235982053,1.18,1.18]
[null,120,0.64783739305871035,0.64783739305871046,0.79627110811570567,0.79625512433697287,0.64783739305871035,0.64783739305871046,0.14843371505699526,0.14841773127826247,0.5,0.5]

{"sheet":"INPUT","index":2,"n_rows":32,"n_cols":10,"rows_kept":32,"cut":false,"hidden":false,"merged":[[1,0,2,16383]]}
[]
[]
[]
[]
[]
[null,"Data simulação",{"$f":"TODAY()","v":"2024-08-27"}]
[]
[null,"Nome do Participante / Matrícula","[ inserir seu nome ]"]
[null,"Sexo",null,null,"Selecione: Masc / Fem",null,null,null,null," "]
[null,"Data de Nascimento",null,null,"dd/mm/aaaa"]
[null,"Data da Admissão na Patrocinadora",null,null,"dd/mm/aaaa"]
[null,"Data de Inscrição no Plano",null,null,"dd/mm/aaaa"]
[null,"Possui Dependentes",null,null,"Selecione: Sim / Não"]
[]
[]
[]
[null,"Salário de Contribuição"]
[null,"Saldo de Conta Total Atual",null,null,"Disponível no Extrato de Contribuições"]
[null,"Saldo da Conta de Recursos Portados"]
[null,"Contribuição Adicional",null,null,"até 12%, opcional e sem paridade do patrocinador"]
[]
[null,"Idade mínima \n(elegibilidade para Aposentadoria)",55]
[null,"Idade Desejada para Aposentadoria",null,null,"em anos"]
[null,"Tipo de Renda escolhida",null,null,"Selecione: tipo de renda"]
[null,"Resgate Parcial em Parcela Única",null,null,"até 20%"]
[null,"Quantidade de Parcelas a Receber ao ano",null,null,"Selecione: quantidade de parcelas"]
[]
[null,"Prazo para recebimento de Renda \npor Prazo Determinado",10,null,"Selecione: prazo (em anos)"]
[null,"Percentual do Saldo de Conta \npara a Renda ",2.5000000000000001E-3,null,"Selecione: % desejado variação a cada 0,05%, até 1,50%"]
[]
[null,"Versão: 5.2 (2023)"]
[null,"Desenvolvido por:"]

{"sheet":"FLUXO","index":3,"n_rows":600,"n_cols":7,"rows_kept":600,"cut":false,"hidden":false,"merged":[]}
[]
[null,"Fluxo de Saldos e Contribuições"]
[]
[]
[null,"Final:","-",{"$f":"MAX(D6:D1048576)","v":0},"-",{"$f":"MAX(F6:F1048576)","v":0},{"$f":"MAX(G6:G1048576)","v":0}]
[null,"Tempo (em meses)","x + t","Saldo Total Inicial","Contribuições Total","Saldo Total Final","Total"]
[null,0,{"$f":"CALCULOS!F14+B7","v":1496},{"$f":"CALCULOS!C37","v":0},0,{"$f":"E7","v":0},{"$f":"IF(B7=\"-\",\"-\",SUM(D7,F7))","v":0}]
[null,{"$f":"IF(OR(B7>=CALCULOS!$F$18,B7=\"-\"),\"-\",B7+1)","v":"-"},{"$f":"IF(B8=\"-\",\"-\",CALCULOS!$F$14+B8)","v":"-"},{"$f":"IF(B8=\"-\",\"-\",D7*(1+CALCULOS!$C$27))","v":"-"},{"$f":"IF(B8=\"-\",\"-\",IF(B8=1,CALCULOS!$C$47,IF(MOD(B7,12)=0,E6*(1+CALCULOS!$C$28),E7))*IF(MOD(B8,12)=0,2,1))","v":"-"},{"$f":"IF(B8=\"-\",\"-\",F7*(1+CALCULOS!$C$27)+E8)","v":"-"},"-"]
[null,{"$f":"IF(OR(B8>=CALCULOS!$F$18,B8=\"-\"),\"-\",B8+1)","v":"-"},{"$f":"IF(B9=\"-\",\"-\",CALCULOS!$F$14+B9)","v":"-"},{"$f":"IF(B9=\"-\",\"-\",D8*(1+CALCULOS!$C$27))","v":"-"},{"$f":"IF(B9=\"-\",\"-\",IF(B9=1,CALCULOS!$C$47,IF(MOD(B8,12)=0,E7*(1+CALCULOS!$C$28),E8))*IF(MOD(B9,12)=0,2,1))","v":"-"},{"$f":"IF(B9=\"-\",\"-\",F8*(1+CALCULOS!$C$27)+E9)","v":"-"},{"$f":"IF(B9=\"-\",\"-\",SUM(D9,F9))","v":"-"}]
[null,{"$f":"IF(OR(B9>=CALCULOS!$F$18,B9=\"-\"),\"-\",B9+1)","v":"-"},{"$f":"IF(B10=\"-\",\"-\",CALCULOS!$F$14+B10)","v":"-"},{"$f":"IF(B10=\"-\",\"-\",D9*(1+CALCULOS!$C$27))","v":"-"},{"$f":"IF(B10=\"-\",\"-\",IF(B10=1,CALCULOS!$C$47,IF(MOD(B9,12)=0,E8*(1+CALCULOS!$C$28),E9))*IF(MOD(B10,12)=0,2,1))","v":"-"},{"$f":"IF(B10=\"-\",\"-\",F9*(1+CALCULOS!$C$27)+E10)","v":"-"},{"$f":"IF(B10=\"-\",\"-\",SUM(D10,F10))","v":"-"}]
[null,{"$f":"IF(OR(B10>=CALCULOS!$F$18,B10=\"-\"),\"-\",B10+1)","v":"-"},{"$f":"IF(B11=\"-\",\"-\",CALCULOS!$F$14+B11)","v":"-"},{"$f":"IF(B11=\"-\",\"-\",D10*(1+CALCULOS!$C$27))","v":"-"},{"$f":"IF(B11=\"-\",\"-\",IF(B11=1,CALCULOS!$C$47,IF(MOD(B10,12)=0,E9*(1+CALCULOS!$C$28),E10))*IF(MOD(B11,12)=0,2,1))","v":"-"},{"$f":"IF(B11=\"-\",\"-\",F10*(1+CALCULOS!$C$27)+E11)","v":"-"},"-"]
[null,{"$f":"IF(OR(B11>=CALCULOS!$F$18,B11=\"-\"),\"-\",B11+1)","v":"-"},{"$f":"IF(B12=\"-\",\"-\",CALCULOS!$F$14+B12)","v":"-"},{"$f":"IF(B12=\"-\",\"-\",D11*(1+CALCULOS!$C$27))","v":"-"},{"$f":"IF(B12=\"-\",\"-\",IF(B12=1,CALCULOS!$C$47,IF(MOD(B11,12)=0,E10*(1+CALCULOS!$C$28),E11))*IF(MOD(B12,12)=0,2,1))","v":"-"},{"$f":"IF(B12=\"-\",\"-\",F11*(1+CALCULOS!$C$27)+E12)","v":"-"},"-"]
[null,{"$f":"IF(OR(B12>=CALCULOS!$F$18,B12=\"-\"),\"-\",B12+1)","v":"-"},{"$f":"IF(B13=\"-\",\"-\",CALCULOS!$F$14+B13)","v":"-"},{"$f":"IF(B13=\"-\",\"-\",D12*(1+CALCULOS!$C$27))","v":"-"},{"$f":"IF(B13=\"-\",\"-\",IF(B13=1,CALCULOS!$C$47,IF(MOD(B12,12)=0,E11*(1+CALCULOS!$C$28),E12))*IF(MOD(B13,12)=0,2,1))","v":"-"},{"$f":"IF(B13=\"-\",\"-\",F12*(1+CALCULOS!$C$27)+E13)","v":"-"},"-"]
[null,{"$f":"IF(OR(B13>=CALCULOS!$F$18,B13=\"-\"),\"-\",B13+1)","v":"-"},{"$f":"IF(B14=\"-\",\"-\",CALCULOS!$F$14+B14)","v":"-"},{"$f":"IF(B14=\"-\",\"-\",D13*(1+CALCULOS!$C$27))","v":"-"},{"$f":"IF(B14=\"-\",\"-\",IF(B14=1,CALCULOS!$C$47,IF(MOD(B13,12)=0,E12*(1+CALCULOS!$C$28),E13))*IF(MOD(B14,12)=0,2,1))","v":"-"},{"$f":"IF(B14=\"-\",\"-\",F13*(1+CALCULOS!$C$27)+E14)","v":"-"},"-"]
[null,{"$f":"IF(OR(B14>=CALCULOS!$F$18,B14=\"-\"),\"-\",B14+1)","v":"-"},{"$f":"IF(B15=\"-\",\"-\",CALCULOS!$F$14+B15)","v":"-"},{"$f":"IF(B15=\"-\",\"-\",D14*(1+CALCULOS!$C$27))","v":"-"},{"$f":"IF(B15=\"-\",\"-\",IF(B15=1,CALCULOS!$C$47,IF(MOD(B14,12)=0,E13*(1+CALCULOS!$C$28),E14))*IF(MOD(B15,12)=0,2,1))","v":"-"},{"$f":"IF(B15=\"-\",\"-\",F14*(1+CALCULOS!$C$27)+E15)","v":"-"},"-"]
[null,{"$f":"IF(OR(B15>=CALCULOS!$F$18,B15=\"-\"),\"-\",B15+1)","v":"-"},{"$f":"IF(B16=\"-\",\"-\",CALCULOS!$F$14+B16)","v":"-"},{"$f":"IF(B16=\"-\",\"-\",D15*(1+CALCULOS!$C$27))","v":"-"},{"$f":"IF(B16=\"-\",\"-\",IF(B16=1,CALCULOS!$C$47,IF(MOD(B15,12)=0,E14*(1+CALCULOS!$C$28),E15))*IF(MOD(B16,12)=0,2,1))","v":"-"},{"$f":"IF(B16=\"-\",\"-\",F15*(1+CALCULOS!$C$27)+E16)","v":"-"},"-"]
[null,{"$f":"IF(OR(B16>=CALCULOS!$F$18,B16=\"-\"),\"-\",B16+1)","v":"-"},{"$f":"IF(B17=\"-\",\"-\",CALCULOS!$F$14+B17)","v":"-"},{"$f":"IF(B17=\"-\",\"-\",D16*(1+CALCULOS!$C$27))","v":"-"},{"$f":"IF(B17=\"-\",\"-\",IF(B17=1,CALCULOS!$C$47,IF(MOD(B16,12)=0,E15*(1+CALCULOS!$C$28),E16))*IF(MOD(B17,12)=0,2,1))","v":"-"},{"$f":"IF(B17=\"-\",\"-\",F16*(1+CALCULOS!$C$27)+E17)","v":"-"},"-"]
[null,{"$f":"IF(OR(B17>=CALCULOS!$F$18,B17=\"-\"),\"-\",B17+1)","v":"-"},{"$f":"IF(B18=\"-\",\"-\",CALCULOS!$F$14+B18)","v":"-"},{"$f":"IF(B18=\"-\",\"-\",D17*(1+CALCULOS!$C$27))","v":"-"},{"$f":"IF(B18=\"-\",\"-\",IF(B18=1,CALCULOS!$C$47,IF(MOD(B17,12)=0,E16*(1+CALCULOS!$C$28),E17))*IF(MOD(B18,12)=0,2,1))","v":"-"},{"$f":"IF(B18=\"-\",\"-\",F17*(1+CALCULOS!$C$27)+E18)","v":"-"},"-"]
[null,{"$f":"IF(OR(B18>=CALCULOS!$F$18,B18=\"-\"),\"-\",B18+1)","v":"-"},{"$f":"IF(B19=\"-\",\"-\",CALCULOS!$F$14+B19)","v":"-"},{"$f":"IF(B19=\"-\",\"-\",D18*(1+CALCULOS!$C$27))","v":"-"},{"$f":"IF(B19=\"-\",\"-\",IF(B19=1,CALCULOS!$C$47,IF(MOD(B18,12)=0,E17*(1+CALCULOS!$C$28),E18))*IF(MOD(B19,12)=0,2,1))","v":"-"},{"$f":"IF(B19=\"-\",\"-\",F18*(1+CALCULOS!$C$27)+E19)","v":"-"},"-"]
[null,{"$f":"IF(OR(B19>=CALCULOS!$F$18,B19=\"-\"),\"-\",B19+1)","v":"-"},{"$f":"IF(B20=\"-\",\"-\",CALCULOS!$F$14+B20)","v":"-"},{"$f":"IF(B20=\"-\",\"-\",D19*(1+CALCULOS!$C$27))","v":"-"},{"$f":"IF(B20=\"-\",\"-\",IF(B20=1,CALCULOS!$C$47,IF(MOD(B19,12)=0,E18*(1+CALCULOS!$C$28),E19))*IF(MOD(B20,12)=0,2,1))","v":"-"},{"$f":"IF(B20=\"-\",\"-\",F19*(1+CALCULOS!$C$27)+E20)","v":"-"},"-"]
[null,{"$f":"IF(OR(B20>=CALCULOS!$F$18,B20=\"-\"),\"-\",B20+1)","v":"-"},{"$f":"IF(B21=\"-\",\"-\",CALCULOS!$F$14+B21)","v":"-"},{"$f":"IF(B21=\"-\",\"-\",D20*(1+CALCULOS!$C$27))","v":"-"},{"$f":"IF(B21=\"-\",\"-\",IF(B21=1,CALCULOS!$C$47,IF(MOD(B20,12)=0,E19*(1+CALCULOS!$C$28),E20))*IF(MOD(B21,12)=0,2,1))","v":"-"},{"$f":"IF(B21=\"-\",\"-\",F20*(1+CALCULOS!$C$27)+E21)","v":"-"},"-"]
[null,{"$f":"IF(OR(B21>=CALCULOS!$F$18,B21=\"-\"),\"-\",B21+1)","v":"-"},{"$f":"IF(B22=\"-\",\"-\",CALCULOS!$F$14+B22)","v":"-"},{"$f":"IF(B22=\"-\",\"-\",D21*(1+CALCULOS!$C$27))","v":"-"},{"$f":"IF(B22=\"-\",\"-\",IF(B22=1,CALCULOS!$C$47,IF(MOD(B21,12)=0,E20*(1+CALCULOS!$C$28),E21))*IF(MOD(B22,12)=0,2,1))","v":"-"},{"$f":"IF(B22=\"-\",\"-\",F21*(1+CALCULOS!$C$27)+E22)","v":"-"},"-"]
[null,{"$f":"IF(OR(B22>=CALCULOS!$F$18,B22=\"-\"),\"-\",B22+1)","v":"-"},{"$f":"IF(B23=\"-\",\"-\",CALCULOS!$F$14+B23)","v":"-"},{"$f":"IF(B23=\"-\",\"-\",D22*(1+CALCULOS!$C$27))","v":"-"},{"$f":"IF(B23=\"-\",\"-\",IF(B23=1,CALCULOS!$C$47,IF(MOD(B22,12)=0,E21*(1+CALCULOS!$C$28),E22))*IF(MOD(B23,12)=0,2,1))","v":"-"},{"$f":"IF(B23=\"-\",\"-\",F22*(1+CALCULOS!$C$27)+E23)","v":"-"},"-"]
[null,{"$f":"IF(OR(B23>=CALCULOS!$F$18,B23=\"-\"),\"-\",B23+1)","v":"-"},{"$f":"IF(B24=\"-\",\"-\",CALCULOS!$F$14+B24)","v":"-"},{"$f":"IF(B24=\"-\",\"-\",D23*(1+CALCULOS!$C$27))","v":"-"},{"$f":"IF(B24=\"-\",\"-\",IF(B24=1,CALCULOS!$C$47,IF(MOD(B23,12)=0,E22*(1+CALCULOS!$C$28),E23))*IF(MOD(B24,12)=0,2,1))","v":"-"},{"$f":"IF(B24=\"-\",\"-\",F23*(1+CALCULOS!$C$27)+E24)","v":"-"},"-"]
[null,{"$f":"IF(OR(B24>=CALCULOS!$F$18,B24=\"-\"),\"-\",B24+1)","v":"-"},{"$f":"IF(B25=\"-\",\"-\",CALCULOS!$F$14+B25)","v":"-"},{"$f":"IF(B25=\"-\",\"-\",D24*(1+CALCULOS!$C$27))","v":"-"},{"$f":"IF(B25=\"-\",\"-\",IF(B25=1,CALCULOS!$C$47,IF(MOD(B24,12)=0,E23*(1+CALCULOS!$C$28),E24))*IF(MOD(B25,12)=0,2,1))","v":"-"},{"$f":"IF(B25=\"-\",\"-\",F24*(1+CALCULOS!$C$27)+E25)","v":"-"},"-"]
[null,{"$f":"IF(OR(B25>=CALCULOS!$F$18,B25=\"-\"),\"-\",B25+1)","v":"-"},{"$f":"IF(B26=\"-\",\"-\",CALCULOS!$F$14+B26)","v":"-"},{"$f":"IF(B26=\"-\",\"-\",D25*(1+CALCULOS!$C$27))","v":"-"},{"$f":"IF(B26=\"-\",\"-\",IF(B26=1,CALCULOS!$C$47,IF(MOD(B25,12)=0,E24*(1+CALCULOS!$C$28),E25))*IF(MOD(B26,12)=0,2,1))","v":"-"},{"$f":"IF(B26=\"-\",\"-\",F25*(1+CALCULOS!$C$27)+E26)","v":"-"},"-"]
[null,{"$f":"IF(OR(B26>=CALCULOS!$F$18,B26=\"-\"),\"-\",B26+1)","v":"-"},{"$f":"IF(B27=\"-\",\"-\",CALCULOS!$F$14+B27)","v":"-"},{"$f":"IF(B27=\"-\",\"-\",D26*(1+CALCULOS!$C$27))","v":"-"},{"$f":"IF(B27=\"-\",\"-\",IF(B27=1,CALCULOS!$C$47,IF(MOD(B26,12)=0,E25*(1+CALCULOS!$C$28),E26))*IF(MOD(B27,12)=0,2,1))","v":"-"},{"$f":"IF(B27=\"-\",\"-\",F26*(1+CALCULOS!$C$27)+E27)","v":"-"},"-"]
[null,{"$f":"IF(OR(B27>=CALCULOS!$F$18,B27=\"-\"),\"-\",B27+1)","v":"-"},{"$f":"IF(B28=\"-\",\"-\",CALCULOS!$F$14+B28)","v":"-"},{"$f":"IF(B28=\"-\",\"-\",D27*(1+CALCULOS!$C$27))","v":"-"},{"$f":"IF(B28=\"-\",\"-\",IF(B28=1,CALCULOS!$C$47,IF(MOD(B27,12)=0,E26*(1+CALCULOS!$C$28),E27))*IF(MOD(B28,12)=0,2,1))","v":"-"},{"$f":"IF(B28=\"-\",\"-\",F27*(1+CALCULOS!$C$27)+E28)","v":"-"},"-"]
[null,{"$f":"IF(OR(B28>=CALCULOS!$F$18,B28=\"-\"),\"-\",B28+1)","v":"-"},{"$f":"IF(B29=\"-\",\"-\",CALCULOS!$F$14+B29)","v":"-"},{"$f":"IF(B29=\"-\",\"-\",D28*(1+CALCULOS!$C$27))","v":"-"},{"$f":"IF(B29=\"-\",\"-\",IF(B29=1,CALCULOS!$C$47,IF(MOD(B28,12)=0,E27*(1+CALCULOS!$C$28),E28))*IF(MOD(B29,12)=0,2,1))","v":"-"},{"$f":"IF(B29=\"-\",\"-\",F28*(1+CALCULOS!$C$27)+E29)","v":"-"},"-"]
[null,{"$f":"IF(OR(B29>=CALCULOS!$F$18,B29=\"-\"),\"-\",B29+1)","v":"-"},{"$f":"IF(B30=\"-\",\"-\",CALCULOS!$F$14+B30)","v":"-"},{"$f":"IF(B30=\"-\",\"-\",D29*(1+CALCULOS!$C$27))","v":"-"},{"$f":"IF(B30=\"-\",\"-\",IF(B30=1,CALCULOS!$C$47,IF(MOD(B29,12)=0,E28*(1+CALCULOS!$C$28),E29))*IF(MOD(B30,12)=0,2,1))","v":"-"},{"$f":"IF(B30=\"-\",\"-\",F29*(1+CALCULOS!$C$27)+E30)","v":"-"},"-"]
[null,{"$f":"IF(OR(B30>=CALCULOS!$F$18,B30=\"-\"),\"-\",B30+1)","v":"-"},{"$f":"IF(B31=\"-\",\"-\",CALCULOS!$F$14+B31)","v":"-"},{"$f":"IF(B31=\"-\",\"-\",D30*(1+CALCULOS!$C$27))","v":"-"},{"$f":"IF(B31=\"-\",\"-\",IF(B31=1,CALCULOS!$C$47,IF(MOD(B30,12)=0,E29*(1+CALCULOS!$C$28),E30))*IF(MOD(B31,12)=0,2,1))","v":"-"},{"$f":"IF(B31=\"-\",\"-\",F30*(1+CALCULOS!$C$27)+E31)","v":"-"},"-"]
[null,{"$f":"IF(OR(B31>=CALCULOS!$F$18,B31=\"-\"),\"-\",B31+1)","v":"-"},{"$f":"IF(B32=\"-\",\"-\",CALCULOS!$F$14+B32)","v":"-"},{"$f":"IF(B32=\"-\",\"-\",D31*(1+CALCULOS!$C$27))","v":"-"},{"$f":"IF(B32=\"-\",\"-\",IF(B32=1,CALCULOS!$C$47,IF(MOD(B31,12)=0,E30*(1+CALCULOS!$C$28),E31))*IF(MOD(B32,12)=0,2,1))","v":"-"},{"$f":"IF(B32=\"-\",\"-\",F31*(1+CALCULOS!$C$27)+E32)","v":"-"},"-"]
[null,{"$f":"IF(OR(B32>=CALCULOS!$F$18,B32=\"-\"),\"-\",B32+1)","v":"-"},{"$f":"IF(B33=\"-\",\"-\",CALCULOS!$F$14+B33)","v":"-"},{"$f":"IF(B33=\"-\",\"-\",D32*(1+CALCULOS!$C$27))","v":"-"},{"$f":"IF(B33=\"-\",\"-\",IF(B33=1,CALCULOS!$C$47,IF(MOD(B32,12)=0,E31*(1+CALCULOS!$C$28),E32))*IF(MOD(B33,12)=0,2,1))","v":"-"},{"$f":"IF(B33=\"-\",\"-\",F32*(1+CALCULOS!$C$27)+E33)","v":"-"},"-"]
[null,{"$f":"IF(OR(B33>=CALCULOS!$F$18,B33=\"-\"),\"-\",B33+1)","v":"-"},{"$f":"IF(B34=\"-\",\"-\",CALCULOS!$F$14+B34)","v":"-"},{"$f":"IF(B34=\"-\",\"-\",D33*(1+CALCULOS!$C$27))","v":"-"},{"$f":"IF(B34=\"-\",\"-\",IF(B34=1,CALCULOS!$C$47,IF(MOD(B33,12)=0,E32*(1+CALCULOS!$C$28),E33))*IF(MOD(B34,12)=0,2,1))","v":"-"},{"$f":"IF(B34=\"-\",\"-\",F33*(1+CALCULOS!$C$27)+E34)","v":"-"},"-"]
[null,{"$f":"IF(OR(B34>=CALCULOS!$F$18,B34=\"-\"),\"-\",B34+1)","v":"-"},{"$f":"IF(B35=\"-\",\"-\",CALCULOS!$F$14+B35)","v":"-"},{"$f":"IF(B35=\"-\",\"-\",D34*(1+CALCULOS!$C$27))","v":"-"},{"$f":"IF(B35=\"-\",\"-\",IF(B35=1,CALCULOS!$C$47,IF(MOD(B34,12)=0,E33*(1+CALCULOS!$C$28),E34))*IF(MOD(B35,12)=0,2,1))","v":"-"},{"$f":"IF(B35=\"-\",\"-\",F34*(1+CALCULOS!$C$27)+E35)","v":"-"},"-"]
[null,{"$f":"IF(OR(B35>=CALCULOS!$F$18,B35=\"-\"),\"-\",B35+1)","v":"-"},{"$f":"IF(B36=\"-\",\"-\",CALCULOS!$F$14+B36)","v":"-"},{"$f":"IF(B36=\"-\",\"-\",D35*(1+CALCULOS!$C$27))","v":"-"},{"$f":"IF(B36=\"-\",\"-\",IF(B36=1,CALCULOS!$C$47,IF(MOD(B35,12)=0,E34*(1+CALCULOS!$C$28),E35))*IF(MOD(B36,12)=0,2,1))","v":"-"},{"$f":"IF(B36=\"-\",\"-\",F35*(1+CALCULOS!$C$27)+E36)","v":"-"},"-"]
[null,{"$f":"IF(OR(B36>=CALCULOS!$F$18,B36=\"-\"),\"-\",B36+1)","v":"-"},{"$f":"IF(B37=\"-\",\"-\",CALCULOS!$F$14+B37)","v":"-"},{"$f":"IF(B37=\"-\",\"-\",D36*(1+CALCULOS!$C$27))","v":"-"},{"$f":"IF(B37=\"-\",\"-\",IF(B37=1,CALCULOS!$C$47,IF(MOD(B36,12)=0,E35*(1+CALCULOS!$C$28),E36))*IF(MOD(B37,12)=0,2,1))","v":"-"},{"$f":"IF(B37=\"-\",\"-\",F36*(1+CALCULOS!$C$27)+E37)","v":"-"},"-"]
[null,{"$f":"IF(OR(B37>=CALCULOS!$F$18,B37=\"-\"),\"-\",B37+1)","v":"-"},{"$f":"IF(B38=\"-\",\"-\",CALCULOS!$F$14+B38)","v":"-"},{"$f":"IF(B38=\"-\",\"-\",D37*(1+CALCULOS!$C$27))","v":"-"},{"$f":"IF(B38=\"-\",\"-\",IF(B38=1,CALCULOS!$C$47,IF(MOD(B37,12)=0,E36*(1+CALCULOS!$C$28),E37))*IF(MOD(B38,12)=0,2,1))","v":"-"},{"$f":"IF(B38=\"-\",\"-\",F37*(1+CALCULOS!$C$27)+E38)","v":"-"},"-"]
[null,{"$f":"IF(OR(B38>=CALCULOS!$F$18,B38=\"-\"),\"-\",B38+1)","v":"-"},{"$f":"IF(B39=\"-\",\"-\",CALCULOS!$F$14+B39)","v":"-"},{"$f":"IF(B39=\"-\",\"-\",D38*(1+CALCULOS!$C$27))","v":"-"},{"$f":"IF(B39=\"-\",\"-\",IF(B39=1,CALCULOS!$C$47,IF(MOD(B38,12)=0,E37*(1+CALCULOS!$C$28),E38))*IF(MOD(B39,12)=0,2,1))","v":"-"},{"$f":"IF(B39=\"-\",\"-\",F38*(1+CALCULOS!$C$27)+E39)","v":"-"},"-"]
[null,{"$f":"IF(OR(B39>=CALCULOS!$F$18,B39=\"-\"),\"-\",B39+1)","v":"-"},{"$f":"IF(B40=\"-\",\"-\",CALCULOS!$F$14+B40)","v":"-"},{"$f":"IF(B40=\"-\",\"-\",D39*(1+CALCULOS!$C$27))","v":"-"},{"$f":"IF(B40=\"-\",\"-\",IF(B40=1,CALCULOS!$C$47,IF(MOD(B39,12)=0,E38*(1+CALCULOS!$C$28),E39))*IF(MOD(B40,12)=0,2,1))","v":"-"},{"$f":"IF(B40=\"-\",\"-\",F39*(1+CALCULOS!$C$27)+E40)","v":"-"},"-"]
[null,{"$f":"IF(OR(B40>=CALCULOS!$F$18,B40=\"-\"),\"-\",B40+1)","v":"-"},{"$f":"IF(B41=\"-\",\"-\",CALCULOS!$F$14+B41)","v":"-"},{"$f":"IF(B41=\"-\",\"-\",D40*(1+CALCULOS!$C$27))","v":"-"},{"$f":"IF(B41=\"-\",\"-\",IF(B41=1,CALCULOS!$C$47,IF(MOD(B40,12)=0,E39*(1+CALCULOS!$C$28),E40))*IF(MOD(B41,12)=0,2,1))","v":"-"},{"$f":"IF(B41=\"-\",\"-\",F40*(1+CALCULOS!$C$27)+E41)","v":"-"},"-"]
[null,{"$f":"IF(OR(B41>=CALCULOS!$F$18,B41=\"-\"),\"-\",B41+1)","v":"-"},{"$f":"IF(B42=\"-\",\"-\",CALCULOS!$F$14+B42)","v":"-"},{"$f":"IF(B42=\"-\",\"-\",D41*(1+CALCULOS!$C$27))","v":"-"},{"$f":"IF(B42=\"-\",\"-\",IF(B42=1,CALCULOS!$C$47,IF(MOD(B41,12)=0,E40*(1+CALCULOS!$C$28),E41))*IF(MOD(B42,12)=0,2,1))","v":"-"},{"$f":"IF(B42=\"-\",\"-\",F41*(1+CALCULOS!$C$27)+E42)","v":"-"},"-"]
[null,{"$f":"IF(OR(B42>=CALCULOS!$F$18,B42=\"-\"),\"-\",B42+1)","v":"-"},{"$f":"IF(B43=\"-\",\"-\",CALCULOS!$F$14+B43)","v":"-"},{"$f":"IF(B43=\"-\",\"-\",D42*(1+CALCULOS!$C$27))","v":"-"},{"$f":"IF(B43=\"-\",\"-\",IF(B43=1,CALCULOS!$C$47,IF(MOD(B42,12)=0,E41*(1+CALCULOS!$C$28),E42))*IF(MOD(B43,12)=0,2,1))","v":"-"},{"$f":"IF(B43=\"-\",\"-\",F42*(1+CALCULOS!$C$27)+E43)","v":"-"},"-"]
[null,{"$f":"IF(OR(B43>=CALCULOS!$F$18,B43=\"-\"),\"-\",B43+1)","v":"-"},{"$f":"IF(B44=\"-\",\"-\",CALCULOS!$F$14+B44)","v":"-"},{"$f":"IF(B44=\"-\",\"-\",D43*(1+CALCULOS!$C$27))","v":"-"},{"$f":"IF(B44=\"-\",\"-\",IF(B44=1,CALCULOS!$C$47,IF(MOD(B43,12)=0,E42*(1+CALCULOS!$C$28),E43))*IF(MOD(B44,12)=0,2,1))","v":"-"},{"$f":"IF(B44=\"-\",\"-\",F43*(1+CALCULOS!$C$27)+E44)","v":"-"},"-"]
[null,{"$f":"IF(OR(B44>=CALCULOS!$F$18,B44=\"-\"),\"-\",B44+1)","v":"-"},{"$f":"IF(B45=\"-\",\"-\",CALCULOS!$F$14+B45)","v":"-"},{"$f":"IF(B45=\"-\",\"-\",D44*(1+CALCULOS!$C$27))","v":"-"},{"$f":"IF(B45=\"-\",\"-\",IF(B45=1,CALCULOS!$C$47,IF(MOD(B44,12)=0,E43*(1+CALCULOS!$C$28),E44))*IF(MOD(B45,12)=0,2,1))","v":"-"},{"$f":"IF(B45=\"-\",\"-\",F44*(1+CALCULOS!$C$27)+E45)","v":"-"},"-"]
[null,{"$f":"IF(OR(B45>=CALCULOS!$F$18,B45=\"-\"),\"-\",B45+1)","v":"-"},{"$f":"IF(B46=\"-\",\"-\",CALCULOS!$F$14+B46)","v":"-"},{"$f":"IF(B46=\"-\",\"-\",D45*(1+CALCULOS!$C$27))","v":"-"},{"$f":"IF(B46=\"-\",\"-\",IF(B46=1,CALCULOS!$C$47,IF(MOD(B45,12)=0,E44*(1+CALCULOS!$C$28),E45))*IF(MOD(B46,12)=0,2,1))","v":"-"},{"$f":"IF(B46=\"-\",\"-\",F45*(1+CALCULOS!$C$27)+E46)","v":"-"},"-"]
[null,{"$f":"IF(OR(B46>=CALCULOS!$F$18,B46=\"-\"),\"-\",B46+1)","v":"-"},{"$f":"IF(B47=\"-\",\"-\",CALCULOS!$F$14+B47)","v":"-"},{"$f":"IF(B47=\"-\",\"-\",D46*(1+CALCULOS!$C$27))","v":"-"},{"$f":"IF(B47=\"-\",\"-\",IF(B47=1,CALCULOS!$C$47,IF(MOD(B46,12)=0,E45*(1+CALCULOS!$C$28),E46))*IF(MOD(B47,12)=0,2,1))","v":"-"},{"$f":"IF(B47=\"-\",\"-\",F46*(1+CALCULOS!$C$27)+E47)","v":"-"},"-"]
[null,{"$f":"IF(OR(B47>=CALCULOS!$F$18,B47=\"-\"),\"-\",B47+1)","v":"-"},{"$f":"IF(B48=\"-\",\"-\",CALCULOS!$F$14+B48)","v":"-"},{"$f":"IF(B48=\"-\",\"-\",D47*(1+CALCULOS!$C$27))","v":"-"},{"$f":"IF(B48=\"-\",\"-\",IF(B48=1,CALCULOS!$C$47,IF(MOD(B47,12)=0,E46*(1+CALCULOS!$C$28),E47))*IF(MOD(B48,12)=0,2,1))","v":"-"},{"$f":"IF(B48=\"-\",\"-\",F47*(1+CALCULOS!$C$27)+E48)","v":"-"},"-"]
[null,{"$f":"IF(OR(B48>=CALCULOS!$F$18,B48=\"-\"),\"-\",B48+1)","v":"-"},{"$f":"IF(B49=\"-\",\"-\",CALCULOS!$F$14+B49)","v":"-"},{"$f":"IF(B49=\"-\",\"-\",D48*(1+CALCULOS!$C$27))","v":"-"},{"$f":"IF(B49=\"-\",\"-\",IF(B49=1,CALCULOS!$C$47,IF(MOD(B48,12)=0,E47*(1+CALCULOS!$C$28),E48))*IF(MOD(B49,12)=0,2,1))","v":"-"},{"$f":"IF(B49=\"-\",\"-\",F48*(1+CALCULOS!$C$27)+E49)","v":"-"},"-"]
[null,{"$f":"IF(OR(B49>=CALCULOS!$F$18,B49=\"-\"),\"-\",B49+1)","v":"-"},{"$f":"IF(B50=\"-\",\"-\",CALCULOS!$F$14+B50)","v":"-"},{"$f":"IF(B50=\"-\",\"-\",D49*(1+CALCULOS!$C$27))","v":"-"},{"$f":"IF(B50=\"-\",\"-\",IF(B50=1,CALCULOS!$C$47,IF(MOD(B49,12)=0,E48*(1+CALCULOS!$C$28),E49))*IF(MOD(B50,12)=0,2,1))","v":"-"},{"$f":"IF(B50=\"-\",\"-\",F49*(1+CALCULOS!$C$27)+E50)","v":"-"},"-"]
[null,{"$f":"IF(OR(B50>=CALCULOS!$F$18,B50=\"-\"),\"-\",B50+1)","v":"-"},{"$f":"IF(B51=\"-\",\"-\",CALCULOS!$F$14+B51)","v":"-"},{"$f":"IF(B51=\"-\",\"-\",D50*(1+CALCULOS!$C$27))","v":"-"},{"$f":"IF(B51=\"-\",\"-\",IF(B51=1,CALCULOS!$C$47,IF(MOD(B50,12)=0,E49*(1+CALCULOS!$C$28),E50))*IF(MOD(B51,12)=0,2,1))","v":"-"},{"$f":"IF(B51=\"-\",\"-\",F50*(1+CALCULOS!$C$27)+E51)","v":"-"},"-"]
[null,{"$f":"IF(OR(B51>=CALCULOS!$F$18,B51=\"-\"),\"-\",B51+1)","v":"-"},{"$f":"IF(B52=\"-\",\"-\",CALCULOS!$F$14+B52)","v":"-"},{"$f":"IF(B52=\"-\",\"-\",D51*(1+CALCULOS!$C$27))","v":"-"},{"$f":"IF(B52=\"-\",\"-\",IF(B52=1,CALCULOS!$C$47,IF(MOD(B51,12)=0,E50*(1+CALCULOS!$C$28),E51))*IF(MOD(B52,12)=0,2,1))","v":"-"},{"$f":"IF(B52=\"-\",\"-\",F51*(1+CALCULOS!$C$27)+E52)","v":"-"},"-"]
[null,{"$f":"IF(OR(B52>=CALCULOS!$F$18,B52=\"-\"),\"-\",B52+1)","v":"-"},{"$f":"IF(B53=\"-\",\"-\",CALCULOS!$F$14+B53)","v":"-"},{"$f":"IF(B53=\"-\",\"-\",D52*(1+CALCULOS!$C$27))","v":"-"},{"$f":"IF(B53=\"-\",\"-\",IF(B53=1,CALCULOS!$C$47,IF(MOD(B52,12)=0,E51*(1+CALCULOS!$C$28),E52))*IF(MOD(B53,12)=0,2,1))","v":"-"},{"$f":"IF(B53=\"-\",\"-\",F52*(1+CALCULOS!$C$27)+E53)","v":"-"},"-"]
[null,{"$f":"IF(OR(B53>=CALCULOS!$F$18,B53=\"-\"),\"-\",B53+1)","v":"-"},{"$f":"IF(B54=\"-\",\"-\",CALCULOS!$F$14+B54)","v":"-"},{"$f":"IF(B54=\"-\",\"-\",D53*(1+CALCULOS!$C$27))","v":"-"},{"$f":"IF(B54=\"-\",\"-\",IF(B54=1,CALCULOS!$C$47,IF(MOD(B53,12)=0,E52*(1+CALCULOS!$C$28),E53))*IF(MOD(B54,12)=0,2,1))","v":"-"},{"$f":"IF(B54=\"-\",\"-\",F53*(1+CALCULOS!$C$27)+E54)","v":"-"},"-"]
[null,{"$f":"IF(OR(B54>=CALCULOS!$F$18,B54=\"-\"),\"-\",B54+1)","v":"-"},{"$f":"IF(B55=\"-\",\"-\",CALCULOS!$F$14+B55)","v":"-"},{"$f":"IF(B55=\"-\",\"-\",D54*(1+CALCULOS!$C$27))","v":"-"},{"$f":"IF(B55=\"-\",\"-\",IF(B55=1,CALCULOS!$C$47,IF(MOD(B54,12)=0,E53*(1+CALCULOS!$C$28),E54))*IF(MOD(B55,12)=0,2,1))","v":"-"},{"$f":"IF(B55=\"-\",\"-\",F54*(1+CALCULOS!$C$27)+E55)","v":"-"},"-"]
[null,{"$f":"IF(OR(B55>=CALCULOS!$F$18,B55=\"-\"),\"-\",B55+1)","v":"-"},{"$f":"IF(B56=\"-\",\"-\",CALCULOS!$F$14+B56)","v":"-"},{"$f":"IF(B56=\"-\",\"-\",D55*(1+CALCULOS!$C$27))","v":"-"},{"$f":"IF(B56=\"-\",\"-\",IF(B56=1,CALCULOS!$C$47,IF(MOD(B55,12)=0,E54*(1+CALCULOS!$C$28),E55))*IF(MOD(B56,12)=0,2,1))","v":"-"},{"$f":"IF(B56=\"-\",\"-\",F55*(1+CALCULOS!$C$27)+E56)","v":"-"},"-"]
[null,{"$f":"IF(OR(B56>=CALCULOS!$F$18,B56=\"-\"),\"-\",B56+1)","v":"-"},{"$f":"IF(B57=\"-\",\"-\",CALCULOS!$F$14+B57)","v":"-"},{"$f":"IF(B57=\"-\",\"-\",D56*(1+CALCULOS!$C$27))","v":"-"},{"$f":"IF(B57=\"-\",\"-\",IF(B57=1,CALCULOS!$C$47,IF(MOD(B56,12)=0,E55*(1+CALCULOS!$C$28),E56))*IF(MOD(B57,12)=0,2,1))","v":"-"},{"$f":"IF(B57=\"-\",\"-\",F56*(1+CALCULOS!$C$27)+E57)","v":"-"},"-"]
[null,{"$f":"IF(OR(B57>=CALCULOS!$F$18,B57=\"-\"),\"-\",B57+1)","v":"-"},{"$f":"IF(B58=\"-\",\"-\",CALCULOS!$F$14+B58)","v":"-"},{"$f":"IF(B58=\"-\",\"-\",D57*(1+CALCULOS!$C$27))","v":"-"},{"$f":"IF(B58=\"-\",\"-\",IF(B58=1,CALCULOS!$C$47,IF(MOD(B57,12)=0,E56*(1+CALCULOS!$C$28),E57))*IF(MOD(B58,12)=0,2,1))","v":"-"},{"$f":"IF(B58=\"-\",\"-\",F57*(1+CALCULOS!$C$27)+E58)","v":"-"},"-"]
[null,{"$f":"IF(OR(B58>=CALCULOS!$F$18,B58=\"-\"),\"-\",B58+1)","v":"-"},{"$f":"IF(B59=\"-\",\"-\",CALCULOS!$F$14+B59)","v":"-"},{"$f":"IF(B59=\"-\",\"-\",D58*(1+CALCULOS!$C$27))","v":"-"},{"$f":"IF(B59=\"-\",\"-\",IF(B59=1,CALCULOS!$C$47,IF(MOD(B58,12)=0,E57*(1+CALCULOS!$C$28),E58))*IF(MOD(B59,12)=0,2,1))","v":"-"},{"$f":"IF(B59=\"-\",\"-\",F58*(1+CALCULOS!$C$27)+E59)","v":"-"},"-"]
[null,{"$f":"IF(OR(B59>=CALCULOS!$F$18,B59=\"-\"),\"-\",B59+1)","v":"-"},{"$f":"IF(B60=\"-\",\"-\",CALCULOS!$F$14+B60)","v":"-"},{"$f":"IF(B60=\"-\",\"-\",D59*(1+CALCULOS!$C$27))","v":"-"},{"$f":"IF(B60=\"-\",\"-\",IF(B60=1,CALCULOS!$C$47,IF(MOD(B59,12)=0,E58*(1+CALCULOS!$C$28),E59))*IF(MOD(B60,12)=0,2,1))","v":"-"},{"$f":"IF(B60=\"-\",\"-\",F59*(1+CALCULOS!$C$27)+E60)","v":"-"},"-"]
[null,{"$f":"IF(OR(B60>=CALCULOS!$F$18,B60=\"-\"),\"-\",B60+1)","v":"-"},{"$f":"IF(B61=\"-\",\"-\",CALCULOS!$F$14+B61)","v":"-"},{"$f":"IF(B61=\"-\",\"-\",D60*(1+CALCULOS!$C$27))","v":"-"},{"$f":"IF(B61=\"-\",\"-\",IF(B61=1,CALCULOS!$C$47,IF(MOD(B60,12)=0,E59*(1+CALCULOS!$C$28),E60))*IF(MOD(B61,12)=0,2,1))","v":"-"},{"$f":"IF(B61=\"-\",\"-\",F60*(1+CALCULOS!$C$27)+E61)","v":"-"},"-"]
[null,{"$f":"IF(OR(B61>=CALCULOS!$F$18,B61=\"-\"),\"-\",B61+1)","v":"-"},{"$f":"IF(B62=\"-\",\"-\",CALCULOS!$F$14+B62)","v":"-"},{"$f":"IF(B62=\"-\",\"-\",D61*(1+CALCULOS!$C$27))","v":"-"},{"$f":"IF(B62=\"-\",\"-\",IF(B62=1,CALCULOS!$C$47,IF(MOD(B61,12)=0,E60*(1+CALCULOS!$C$28),E61))*IF(MOD(B62,12)=0,2,1))","v":"-"},{"$f":"IF(B62=\"-\",\"-\",F61*(1+CALCULOS!$C$27)+E62)","v":"-"},"-"]
[null,{"$f":"IF(OR(B62>=CALCULOS!$F$18,B62=\"-\"),\"-\",B62+1)","v":"-"},{"$f":"IF(B63=\"-\",\"-\",CALCULOS!$F$14+B63)","v":"-"},{"$f":"IF(B63=\"-\",\"-\",D62*(1+CALCULOS!$C$27))","v":"-"},{"$f":"IF(B63=\"-\",\"-\",IF(B63=1,CALCULOS!$C$47,IF(MOD(B62,12)=0,E61*(1+CALCULOS!$C$28),E62))*IF(MOD(B63,12)=0,2,1))","v":"-"},{"$f":"IF(B63=\"-\",\"-\",F62*(1+CALCULOS!$C$27)+E63)","v":"-"},"-"]
[null,{"$f":"IF(OR(B63>=CALCULOS!$F$18,B63=\"-\"),\"-\",B63+1)","v":"-"},{"$f":"IF(B64=\"-\",\"-\",CALCULOS!$F$14+B64)","v":"-"},{"$f":"IF(B64=\"-\",\"-\",D63*(1+CALCULOS!$C$27))","v":"-"},{"$f":"IF(B64=\"-\",\"-\",IF(B64=1,CALCULOS!$C$47,IF(MOD(B63,12)=0,E62*(1+CALCULOS!$C$28),E63))*IF(MOD(B64,12)=0,2,1))","v":"-"},{"$f":"IF(B64=\"-\",\"-\",F63*(1+CALCULOS!$C$27)+E64)","v":"-"},"-"]
[null,{"$f":"IF(OR(B64>=CALCULOS!$F$18,B64=\"-\"),\"-\",B64+1)","v":"-"},{"$f":"IF(B65=\"-\",\"-\",CALCULOS!$F$14+B65)","v":"-"},{"$f":"IF(B65=\"-\",\"-\",D64*(1+CALCULOS!$C$27))","v":"-"},{"$f":"IF(B65=\"-\",\"-\",IF(B65=1,CALCULOS!$C$47,IF(MOD(B64,12)=0,E63*(1+CALCULOS!$C$28),E64))*IF(MOD(B65,12)=0,2,1))","v":"-"},{"$f":"IF(B65=\"-\",\"-\",F64*(1+CALCULOS!$C$27)+E65)","v":"-"},"-"]
[null,{"$f":"IF(OR(B65>=CALCULOS!$F$18,B65=\"-\"),\"-\",B65+1)","v":"-"},{"$f":"IF(B66=\"-\",\"-\",CALCULOS!$F$14+B66)","v":"-"},{"$f":"IF(B66=\"-\",\"-\",D65*(1+CALCULOS!$C$27))","v":"-"},{"$f":"IF(B66=\"-\",\"-\",IF(B66=1,CALCULOS!$C$47,IF(MOD(B65,12)=0,E64*(1+CALCULOS!$C$28),E65))*IF(MOD(B66,12)=0,2,1))","v":"-"},{"$f":"IF(B66=\"-\",\"-\",F65*(1+CALCULOS!$C$27)+E66)","v":"-"},"-"]
[null,{"$f":"IF(OR(B66>=CALCULOS!$F$18,B66=\"-\"),\"-\",B66+1)","v":"-"},{"$f":"IF(B67=\"-\",\"-\",CALCULOS!$F$14+B67)","v":"-"},{"$f":"IF(B67=\"-\",\"-\",D66*(1+CALCULOS!$C$27))","v":"-"},{"$f":"IF(B67=\"-\",\"-\",IF(B67=1,CALCULOS!$C$47,IF(MOD(B66,12)=0,E65*(1+CALCULOS!$C$28),E66))*IF(MOD(B67,12)=0,2,1))","v":"-"},{"$f":"IF(B67=\"-\",\"-\",F66*(1+CALCULOS!$C$27)+E67)","v":"-"},"-"]
[null,{"$f":"IF(OR(B67>=CALCULOS!$F$18,B67=\"-\"),\"-\",B67+1)","v":"-"},{"$f":"IF(B68=\"-\",\"-\",CALCULOS!$F$14+B68)","v":"-"},{"$f":"IF(B68=\"-\",\"-\",D67*(1+CALCULOS!$C$27))","v":"-"},{"$f":"IF(B68=\"-\",\"-\",IF(B68=1,CALCULOS!$C$47,IF(MOD(B67,12)=0,E66*(1+CALCULOS!$C$28),E67))*IF(MOD(B68,12)=0,2,1))","v":"-"},{"$f":"IF(B68=\"-\",\"-\",F67*(1+CALCULOS!$C$27)+E68)","v":"-"},"-"]
[null,{"$f":"IF(OR(B68>=CALCULOS!$F$18,B68=\"-\"),\"-\",B68+1)","v":"-"},{"$f":"IF(B69=\"-\",\"-\",CALCULOS!$F$14+B69)","v":"-"},{"$f":"IF(B69=\"-\",\"-\",D68*(1+CALCULOS!$C$27))","v":"-"},{"$f":"IF(B69=\"-\",\"-\",IF(B69=1,CALCULOS!$C$47,IF(MOD(B68,12)=0,E67*(1+CALCULOS!$C$28),E68))*IF(MOD(B69,12)=0,2,1))","v":"-"},{"$f":"IF(B69=\"-\",\"-\",F68*(1+CALCULOS!$C$27)+E69)","v":"-"},"-"]
[null,{"$f":"IF(OR(B69>=CALCULOS!$F$18,B69=\"-\"),\"-\",B69+1)","v":"-"},{"$f":"IF(B70=\"-\",\"-\",CALCULOS!$F$14+B70)","v":"-"},{"$f":"IF(B70=\"-\",\"-\",D69*(1+CALCULOS!$C$27))","v":"-"},{"$f":"IF(B70=\"-\",\"-\",IF(B70=1,CALCULOS!$C$47,IF(MOD(B69,12)=0,E68*(1+CALCULOS!$C$28),E69))*IF(MOD(B70,12)=0,2,1))","v":"-"},{"$f":"IF(B70=\"-\",\"-\",F69*(1+CALCULOS!$C$27)+E70)","v":"-"},"-"]
[null,{"$f":"IF(OR(B70>=CALCULOS!$F$18,B70=\"-\"),\"-\",B70+1)","v":"-"},{"$f":"IF(B71=\"-\",\"-\",CALCULOS!$F$14+B71)","v":"-"},{"$f":"IF(B71=\"-\",\"-\",D70*(1+CALCULOS!$C$27))","v":"-"},{"$f":"IF(B71=\"-\",\"-\",IF(B71=1,CALCULOS!$C$47,IF(MOD(B70,12)=0,E69*(1+CALCULOS!$C$28),E70))*IF(MOD(B71,12)=0,2,1))","v":"-"},{"$f":"IF(B71=\"-\",\"-\",F70*(1+CALCULOS!$C$27)+E71)","v":"-"},"-"]
[null,{"$f":"IF(OR(B71>=CALCULOS!$F$18,B71=\"-\"),\"-\",B71+1)","v":"-"},{"$f":"IF(B72=\"-\",\"-\",CALCULOS!$F$14+B72)","v":"-"},{"$f":"IF(B72=\"-\",\"-\",D71*(1+CALCULOS!$C$27))","v":"-"},{"$f":"IF(B72=\"-\",\"-\",IF(B72=1,CALCULOS!$C$47,IF(MOD(B71,12)=0,E70*(1+CALCULOS!$C$28),E71))*IF(MOD(B72,12)=0,2,1))","v":"-"},{"$f":"IF(B72=\"-\",\"-\",F71*(1+CALCULOS!$C$27)+E72)","v":"-"},"-"]
[null,{"$f":"IF(OR(B72>=CALCULOS!$F$18,B72=\"-\"),\"-\",B72+1)","v":"-"},{"$f":"IF(B73=\"-\",\"-\",CALCULOS!$F$14+B73)","v":"-"},{"$f":"IF(B73=\"-\",\"-\",D72*(1+CALCULOS!$C$27))","v":"-"},{"$f":"IF(B73=\"-\",\"-\",IF(B73=1,CALCULOS!$C$47,IF(MOD(B72,12)=0,E71*(1+CALCULOS!$C$28),E72))*IF(MOD(B73,12)=0,2,1))","v":"-"},{"$f":"IF(B73=\"-\",\"-\",F72*(1+CALCULOS!$C$27)+E73)","v":"-"},"-"]
[null,{"$f":"IF(OR(B73>=CALCULOS!$F$18,B73=\"-\"),\"-\",B73+1)","v":"-"},{"$f":"IF(B74=\"-\",\"-\",CALCULOS!$F$14+B74)","v":"-"},{"$f":"IF(B74=\"-\",\"-\",D73*(1+CALCULOS!$C$27))","v":"-"},{"$f":"IF(B74=\"-\",\"-\",IF(B74=1,CALCULOS!$C$47,IF(MOD(B73,12)=0,E72*(1+CALCULOS!$C$28),E73))*IF(MOD(B74,12)=0,2,1))","v":"-"},{"$f":"IF(B74=\"-\",\"-\",F73*(1+CALCULOS!$C$27)+E74)","v":"-"},{"$f":"IF(B74=\"-\",\"-\",SUM(D74,F74))","v":"-"}]
[null,{"$f":"IF(OR(B74>=CALCULOS!$F$18,B74=\"-\"),\"-\",B74+1)","v":"-"},{"$f":"IF(B75=\"-\",\"-\",CALCULOS!$F$14+B75)","v":"-"},{"$f":"IF(B75=\"-\",\"-\",D74*(1+CALCULOS!$C$27))","v":"-"},{"$f":"IF(B75=\"-\",\"-\",IF(B75=1,CALCULOS!$C$47,IF(MOD(B74,12)=0,E73*(1+CALCULOS!$C$28),E74))*IF(MOD(B75,12)=0,2,1))","v":"-"},{"$f":"IF(B75=\"-\",\"-\",F74*(1+CALCULOS!$C$27)+E75)","v":"-"},"-"]
[null,{"$f":"IF(OR(B75>=CALCULOS!$F$18,B75=\"-\"),\"-\",B75+1)","v":"-"},{"$f":"IF(B76=\"-\",\"-\",CALCULOS!$F$14+B76)","v":"-"},{"$f":"IF(B76=\"-\",\"-\",D75*(1+CALCULOS!$C$27))","v":"-"},{"$f":"IF(B76=\"-\",\"-\",IF(B76=1,CALCULOS!$C$47,IF(MOD(B75,12)=0,E74*(1+CALCULOS!$C$28),E75))*IF(MOD(B76,12)=0,2,1))","v":"-"},{"$f":"IF(B76=\"-\",\"-\",F75*(1+CALCULOS!$C$27)+E76)","v":"-"},"-"]
[null,{"$f":"IF(OR(B76>=CALCULOS!$F$18,B76=\"-\"),\"-\",B76+1)","v":"-"},{"$f":"IF(B77=\"-\",\"-\",CALCULOS!$F$14+B77)","v":"-"},{"$f":"IF(B77=\"-\",\"-\",D76*(1+CALCULOS!$C$27))","v":"-"},{"$f":"IF(B77=\"-\",\"-\",IF(B77=1,CALCULOS!$C$47,IF(MOD(B76,12)=0,E75*(1+CALCULOS!$C$28),E76))*IF(MOD(B77,12)=0,2,1))","v":"-"},{"$f":"IF(B77=\"-\",\"-\",F76*(1+CALCULOS!$C$27)+E77)","v":"-"},"-"]
[null,{"$f":"IF(OR(B77>=CALCULOS!$F$18,B77=\"-\"),\"-\",B77+1)","v":"-"},{"$f":"IF(B78=\"-\",\"-\",CALCULOS!$F$14+B78)","v":"-"},{"$f":"IF(B78=\"-\",\"-\",D77*(1+CALCULOS!$C$27))","v":"-"},{"$f":"IF(B78=\"-\",\"-\",IF(B78=1,CALCULOS!$C$47,IF(MOD(B77,12)=0,E76*(1+CALCULOS!$C$28),E77))*IF(MOD(B78,12)=0,2,1))","v":"-"},{"$f":"IF(B78=\"-\",\"-\",F77*(1+CALCULOS!$C$27)+E78)","v":"-"},"-"]
[null,{"$f":"IF(OR(B78>=CALCULOS!$F$18,B78=\"-\"),\"-\",B78+1)","v":"-"},{"$f":"IF(B79=\"-\",\"-\",CALCULOS!$F$14+B79)","v":"-"},{"$f":"IF(B79=\"-\",\"-\",D78*(1+CALCULOS!$C$27))","v":"-"},{"$f":"IF(B79=\"-\",\"-\",IF(B79=1,CALCULOS!$C$47,IF(MOD(B78,12)=0,E77*(1+CALCULOS!$C$28),E78))*IF(MOD(B79,12)=0,2,1))","v":"-"},{"$f":"IF(B79=\"-\",\"-\",F78*(1+CALCULOS!$C$27)+E79)","v":"-"},"-"]
[null,{"$f":"IF(OR(B79>=CALCULOS!$F$18,B79=\"-\"),\"-\",B79+1)","v":"-"},{"$f":"IF(B80=\"-\",\"-\",CALCULOS!$F$14+B80)","v":"-"},{"$f":"IF(B80=\"-\",\"-\",D79*(1+CALCULOS!$C$27))","v":"-"},{"$f":"IF(B80=\"-\",\"-\",IF(B80=1,CALCULOS!$C$47,IF(MOD(B79,12)=0,E78*(1+CALCULOS!$C$28),E79))*IF(MOD(B80,12)=0,2,1))","v":"-"},{"$f":"IF(B80=\"-\",\"-\",F79*(1+CALCULOS!$C$27)+E80)","v":"-"},"-"]
[null,{"$f":"IF(OR(B80>=CALCULOS!$F$18,B80=\"-\"),\"-\",B80+1)","v":"-"},{"$f":"IF(B81=\"-\",\"-\",CALCULOS!$F$14+B81)","v":"-"},{"$f":"IF(B81=\"-\",\"-\",D80*(1+CALCULOS!$C$27))","v":"-"},{"$f":"IF(B81=\"-\",\"-\",IF(B81=1,CALCULOS!$C$47,IF(MOD(B80,12)=0,E79*(1+CALCULOS!$C$28),E80))*IF(MOD(B81,12)=0,2,1))","v":"-"},{"$f":"IF(B81=\"-\",\"-\",F80*(1+CALCULOS!$C$27)+E81)","v":"-"},"-"]
[null,{"$f":"IF(OR(B81>=CALCULOS!$F$18,B81=\"-\"),\"-\",B81+1)","v":"-"},{"$f":"IF(B82=\"-\",\"-\",CALCULOS!$F$14+B82)","v":"-"},{"$f":"IF(B82=\"-\",\"-\",D81*(1+CALCULOS!$C$27))","v":"-"},{"$f":"IF(B82=\"-\",\"-\",IF(B82=1,CALCULOS!$C$47,IF(MOD(B81,12)=0,E80*(1+CALCULOS!$C$28),E81))*IF(MOD(B82,12)=0,2,1))","v":"-"},{"$f":"IF(B82=\"-\",\"-\",F81*(1+CALCULOS!$C$27)+E82)","v":"-"},"-"]
[null,{"$f":"IF(OR(B82>=CALCULOS!$F$18,B82=\"-\"),\"-\",B82+1)","v":"-"},{"$f":"IF(B83=\"-\",\"-\",CALCULOS!$F$14+B83)","v":"-"},{"$f":"IF(B83=\"-\",\"-\",D82*(1+CALCULOS!$C$27))","v":"-"},{"$f":"IF(B83=\"-\",\"-\",IF(B83=1,CALCULOS!$C$47,IF(MOD(B82,12)=0,E81*(1+CALCULOS!$C$28),E82))*IF(MOD(B83,12)=0,2,1))","v":"-"},{"$f":"IF(B83=\"-\",\"-\",F82*(1+CALCULOS!$C$27)+E83)","v":"-"},"-"]
[null,{"$f":"IF(OR(B83>=CALCULOS!$F$18,B83=\"-\"),\"-\",B83+1)","v":"-"},{"$f":"IF(B84=\"-\",\"-\",CALCULOS!$F$14+B84)","v":"-"},{"$f":"IF(B84=\"-\",\"-\",D83*(1+CALCULOS!$C$27))","v":"-"},{"$f":"IF(B84=\"-\",\"-\",IF(B84=1,CALCULOS!$C$47,IF(MOD(B83,12)=0,E82*(1+CALCULOS!$C$28),E83))*IF(MOD(B84,12)=0,2,1))","v":"-"},{"$f":"IF(B84=\"-\",\"-\",F83*(1+CALCULOS!$C$27)+E84)","v":"-"},"-"]
[null,{"$f":"IF(OR(B84>=CALCULOS!$F$18,B84=\"-\"),\"-\",B84+1)","v":"-"},{"$f":"IF(B85=\"-\",\"-\",CALCULOS!$F$14+B85)","v":"-"},{"$f":"IF(B85=\"-\",\"-\",D84*(1+CALCULOS!$C$27))","v":"-"},{"$f":"IF(B85=\"-\",\"-\",IF(B85=1,CALCULOS!$C$47,IF(MOD(B84,12)=0,E83*(1+CALCULOS!$C$28),E84))*IF(MOD(B85,12)=0,2,1))","v":"-"},{"$f":"IF(B85=\"-\",\"-\",F84*(1+CALCULOS!$C$27)+E85)","v":"-"},"-"]
[null,{"$f":"IF(OR(B85>=CALCULOS!$F$18,B85=\"-\"),\"-\",B85+1)","v":"-"},{"$f":"IF(B86=\"-\",\"-\",CALCULOS!$F$14+B86)","v":"-"},{"$f":"IF(B86=\"-\",\"-\",D85*(1+CALCULOS!$C$27))","v":"-"},{"$f":"IF(B86=\"-\",\"-\",IF(B86=1,CALCULOS!$C$47,IF(MOD(B85,12)=0,E84*(1+CALCULOS!$C$28),E85))*IF(MOD(B86,12)=0,2,1))","v":"-"},{"$f":"IF(B86=\"-\",\"-\",F85*(1+CALCULOS!$C$27)+E86)","v":"-"},"-"]
[null,{"$f":"IF(OR(B86>=CALCULOS!$F$18,B86=\"-\"),\"-\",B86+1)","v":"-"},{"$f":"IF(B87=\"-\",\"-\",CALCULOS!$F$14+B87)","v":"-"},{"$f":"IF(B87=\"-\",\"-\",D86*(1+CALCULOS!$C$27))","v":"-"},{"$f":"IF(B87=\"-\",\"-\",IF(B87=1,CALCULOS!$C$47,IF(MOD(B86,12)=0,E85*(1+CALCULOS!$C$28),E86))*IF(MOD(B87,12)=0,2,1))","v":"-"},{"$f":"IF(B87=\"-\",\"-\",F86*(1+CALCULOS!$C$27)+E87)","v":"-"},"-"]
[null,{"$f":"IF(OR(B87>=CALCULOS!$F$18,B87=\"-\"),\"-\",B87+1)","v":"-"},{"$f":"IF(B88=\"-\",\"-\",CALCULOS!$F$14+B88)","v":"-"},{"$f":"IF(B88=\"-\",\"-\",D87*(1+CALCULOS!$C$27))","v":"-"},{"$f":"IF(B88=\"-\",\"-\",IF(B88=1,CALCULOS!$C$47,IF(MOD(B87,12)=0,E86*(1+CALCULOS!$C$28),E87))*IF(MOD(B88,12)=0,2,1))","v":"-"},{"$f":"IF(B88=\"-\",\"-\",F87*(1+CALCULOS!$C$27)+E88)","v":"-"},"-"]
[null,{"$f":"IF(OR(B88>=CALCULOS!$F$18,B88=\"-\"),\"-\",B88+1)","v":"-"},{"$f":"IF(B89=\"-\",\"-\",CALCULOS!$F$14+B89)","v":"-"},{"$f":"IF(B89=\"-\",\"-\",D88*(1+CALCULOS!$C$27))","v":"-"},{"$f":"IF(B89=\"-\",\"-\",IF(B89=1,CALCULOS!$C$47,IF(MOD(B88,12)=0,E87*(1+CALCULOS!$C$28),E88))*IF(MOD(B89,12)=0,2,1))","v":"-"},{"$f":"IF(B89=\"-\",\"-\",F88*(1+CALCULOS!$C$27)+E89)","v":"-"},"-"]
[null,{"$f":"IF(OR(B89>=CALCULOS!$F$18,B89=\"-\"),\"-\",B89+1)","v":"-"},{"$f":"IF(B90=\"-\",\"-\",CALCULOS!$F$14+B90)","v":"-"},{"$f":"IF(B90=\"-\",\"-\",D89*(1+CALCULOS!$C$27))","v":"-"},{"$f":"IF(B90=\"-\",\"-\",IF(B90=1,CALCULOS!$C$47,IF(MOD(B89,12)=0,E88*(1+CALCULOS!$C$28),E89))*IF(MOD(B90,12)=0,2,1))","v":"-"},{"$f":"IF(B90=\"-\",\"-\",F89*(1+CALCULOS!$C$27)+E90)","v":"-"},"-"]
[null,{"$f":"IF(OR(B90>=CALCULOS!$F$18,B90=\"-\"),\"-\",B90+1)","v":"-"},{"$f":"IF(B91=\"-\",\"-\",CALCULOS!$F$14+B91)","v":"-"},{"$f":"IF(B91=\"-\",\"-\",D90*(1+CALCULOS!$C$27))","v":"-"},{"$f":"IF(B91=\"-\",\"-\",IF(B91=1,CALCULOS!$C$47,IF(MOD(B90,12)=0,E89*(1+CALCULOS!$C$28),E90))*IF(MOD(B91,12)=0,2,1))","v":"-"},{"$f":"IF(B91=\"-\",\"-\",F90*(1+CALCULOS!$C$27)+E91)","v":"-"},"-"]
[null,{"$f":"IF(OR(B91>=CALCULOS!$F$18,B91=\"-\"),\"-\",B91+1)","v":"-"},{"$f":"IF(B92=\"-\",\"-\",CALCULOS!$F$14+B92)","v":"-"},{"$f":"IF(B92=\"-\",\"-\",D91*(1+CALCULOS!$C$27))","v":"-"},{"$f":"IF(B92=\"-\",\"-\",IF(B92=1,CALCULOS!$C$47,IF(MOD(B91,12)=0,E90*(1+CALCULOS!$C$28),E91))*IF(MOD(B92,12)=0,2,1))","v":"-"},{"$f":"IF(B92=\"-\",\"-\",F91*(1+CALCULOS!$C$27)+E92)","v":"-"},"-"]
[null,{"$f":"IF(OR(B92>=CALCULOS!$F$18,B92=\"-\"),\"-\",B92+1)","v":"-"},{"$f":"IF(B93=\"-\",\"-\",CALCULOS!$F$14+B93)","v":"-"},{"$f":"IF(B93=\"-\",\"-\",D92*(1+CALCULOS!$C$27))","v":"-"},{"$f":"IF(B93=\"-\",\"-\",IF(B93=1,CALCULOS!$C$47,IF(MOD(B92,12)=0,E91*(1+CALCULOS!$C$28),E92))*IF(MOD(B93,12)=0,2,1))","v":"-"},{"$f":"IF(B93=\"-\",\"-\",F92*(1+CALCULOS!$C$27)+E93)","v":"-"},"-"]
[null,{"$f":"IF(OR(B93>=CALCULOS!$F$18,B93=\"-\"),\"-\",B93+1)","v":"-"},{"$f":"IF(B94=\"-\",\"-\",CALCULOS!$F$14+B94)","v":"-"},{"$f":"IF(B94=\"-\",\"-\",D93*(1+CALCULOS!$C$27))","v":"-"},{"$f":"IF(B94=\"-\",\"-\",IF(B94=1,CALCULOS!$C$47,IF(MOD(B93,12)=0,E92*(1+CALCULOS!$C$28),E93))*IF(MOD(B94,12)=0,2,1))","v":"-"},{"$f":"IF(B94=\"-\",\"-\",F93*(1+CALCULOS!$C$27)+E94)","v":"-"},"-"]
[null,{"$f":"IF(OR(B94>=CALCULOS!$F$18,B94=\"-\"),\"-\",B94+1)","v":"-"},{"$f":"IF(B95=\"-\",\"-\",CALCULOS!$F$14+B95)","v":"-"},{"$f":"IF(B95=\"-\",\"-\",D94*(1+CALCULOS!$C$27))","v":"-"},{"$f":"IF(B95=\"-\",\"-\",IF(B95=1,CALCULOS!$C$47,IF(MOD(B94,12)=0,E93*(1+CALCULOS!$C$28),E94))*IF(MOD(B95,12)=0,2,1))","v":"-"},{"$f":"IF(B95=\"-\",\"-\",F94*(1+CALCULOS!$C$27)+E95)","v":"-"},"-"]
[null,{"$f":"IF(OR(B95>=CALCULOS!$F$18,B95=\"-\"),\"-\",B95+1)","v":"-"},{"$f":"IF(B96=\"-\",\"-\",CALCULOS!$F$14+B96)","v":"-"},{"$f":"IF(B96=\"-\",\"-\",D95*(1+CALCULOS!$C$27))","v":"-"},{"$f":"IF(B96=\"-\",\"-\",IF(B96=1,CALCULOS!$C$47,IF(MOD(B95,12)=0,E94*(1+CALCULOS!$C$28),E95))*IF(MOD(B96,12)=0,2,1))","v":"-"},{"$f":"IF(B96=\"-\",\"-\",F95*(1+CALCULOS!$C$27)+E96)","v":"-"},"-"]
[null,{"$f":"IF(OR(B96>=CALCULOS!$F$18,B96=\"-\"),\"-\",B96+1)","v":"-"},{"$f":"IF(B97=\"-\",\"-\",CALCULOS!$F$14+B97)","v":"-"},{"$f":"IF(B97=\"-\",\"-\",D96*(1+CALCULOS!$C$27))","v":"-"},{"$f":"IF(B97=\"-\",\"-\",IF(B97=1,CALCULOS!$C$47,IF(MOD(B96,12)=0,E95*(1+CALCULOS!$C$28),E96))*IF(MOD(B97,12)=0,2,1))","v":"-"},{"$f":"IF(B97=\"-\",\"-\",F96*(1+CALCULOS!$C$27)+E97)","v":"-"},"-"]
[null,{"$f":"IF(OR(B97>=CALCULOS!$F$18,B97=\"-\"),\"-\",B97+1)","v":"-"},{"$f":"IF(B98=\"-\",\"-\",CALCULOS!$F$14+B98)","v":"-"},{"$f":"IF(B98=\"-\",\"-\",D97*(1+CALCULOS!$C$27))","v":"-"},{"$f":"IF(B98=\"-\",\"-\",IF(B98=1,CALCULOS!$C$47,IF(MOD(B97,12)=0,E96*(1+CALCULOS!$C$28),E97))*IF(MOD(B98,12)=0,2,1))","v":"-"},{"$f":"IF(B98=\"-\",\"-\",F97*(1+CALCULOS!$C$27)+E98)","v":"-"},"-"]
[null,{"$f":"IF(OR(B98>=CALCULOS!$F$18,B98=\"-\"),\"-\",B98+1)","v":"-"},{"$f":"IF(B99=\"-\",\"-\",CALCULOS!$F$14+B99)","v":"-"},{"$f":"IF(B99=\"-\",\"-\",D98*(1+CALCULOS!$C$27))","v":"-"},{"$f":"IF(B99=\"-\",\"-\",IF(B99=1,CALCULOS!$C$47,IF(MOD(B98,12)=0,E97*(1+CALCULOS!$C$28),E98))*IF(MOD(B99,12)=0,2,1))","v":"-"},{"$f":"IF(B99=\"-\",\"-\",F98*(1+CALCULOS!$C$27)+E99)","v":"-"},"-"]
[null,{"$f":"IF(OR(B99>=CALCULOS!$F$18,B99=\"-\"),\"-\",B99+1)","v":"-"},{"$f":"IF(B100=\"-\",\"-\",CALCULOS!$F$14+B100)","v":"-"},{"$f":"IF(B100=\"-\",\"-\",D99*(1+CALCULOS!$C$27))","v":"-"},{"$f":"IF(B100=\"-\",\"-\",IF(B100=1,CALCULOS!$C$47,IF(MOD(B99,12)=0,E98*(1+CALCULOS!$C$28),E99))*IF(MOD(B100,12)=0,2,1))","v":"-"},{"$f":"IF(B100=\"-\",\"-\",F99*(1+CALCULOS!$C$27)+E100)","v":"-"},"-"]
[null,{"$f":"IF(OR(B100>=CALCULOS!$F$18,B100=\"-\"),\"-\",B100+1)","v":"-"},{"$f":"IF(B101=\"-\",\"-\",CALCULOS!$F$14+B101)","v":"-"},{"$f":"IF(B101=\"-\",\"-\",D100*(1+CALCULOS!$C$27))","v":"-"},{"$f":"IF(B101=\"-\",\"-\",IF(B101=1,CALCULOS!$C$47,IF(MOD(B100,12)=0,E99*(1+CALCULOS!$C$28),E100))*IF(MOD(B101,12)=0,2,1))","v":"-"},{"$f":"IF(B101=\"-\",\"-\",F100*(1+CALCULOS!$C$27)+E101)","v":"-"},"-"]
[null,{"$f":"IF(OR(B101>=CALCULOS!$F$18,B101=\"-\"),\"-\",B101+1)","v":"-"},{"$f":"IF(B102=\"-\",\"-\",CALCULOS!$F$14+B102)","v":"-"},{"$f":"IF(B102=\"-\",\"-\",D101*(1+CALCULOS!$C$27))","v":"-"},{"$f":"IF(B102=\"-\",\"-\",IF(B102=1,CALCULOS!$C$47,IF(MOD(B101,12)=0,E100*(1+CALCULOS!$C$28),E101))*IF(MOD(B102,12)=0,2,1))","v":"-"},{"$f":"IF(B102=\"-\",\"-\",F101*(1+CALCULOS!$C$27)+E102)","v":"-"},"-"]
[null,{"$f":"IF(OR(B102>=CALCULOS!$F$18,B102=\"-\"),\"-\",B102+1)","v":"-"},{"$f":"IF(B103=\"-\",\"-\",CALCULOS!$F$14+B103)","v":"-"},{"$f":"IF(B103=\"-\",\"-\",D102*(1+CALCULOS!$C$27))","v":"-"},{"$f":"IF(B103=\"-\",\"-\",IF(B103=1,CALCULOS!$C$47,IF(MOD(B102,12)=0,E101*(1+CALCULOS!$C$28),E102))*IF(MOD(B103,12)=0,2,1))","v":"-"},{"$f":"IF(B103=\"-\",\"-\",F102*(1+CALCULOS!$C$27)+E103)","v":"-"},"-"]
[null,{"$f":"IF(OR(B103>=CALCULOS!$F$18,B103=\"-\"),\"-\",B103+1)","v":"-"},{"$f":"IF(B104=\"-\",\"-\",CALCULOS!$F$14+B104)","v":"-"},{"$f":"IF(B104=\"-\",\"-\",D103*(1+CALCULOS!$C$27))","v":"-"},{"$f":"IF(B104=\"-\",\"-\",IF(B104=1,CALCULOS!$C$47,IF(MOD(B103,12)=0,E102*(1+CALCULOS!$C$28),E103))*IF(MOD(B104,12)=0,2,1))","v":"-"},{"$f":"IF(B104=\"-\",\"-\",F103*(1+CALCULOS!$C$27)+E104)","v":"-"},"-"]
[null,{"$f":"IF(OR(B104>=CALCULOS!$F$18,B104=\"-\"),\"-\",B104+1)","v":"-"},{"$f":"IF(B105=\"-\",\"-\",CALCULOS!$F$14+B105)","v":"-"},{"$f":"IF(B105=\"-\",\"-\",D104*(1+CALCULOS!$C$27))","v":"-"},{"$f":"IF(B105=\"-\",\"-\",IF(B105=1,CALCULOS!$C$47,IF(MOD(B104,12)=0,E103*(1+CALCULOS!$C$28),E104))*IF(MOD(B105,12)=0,2,1))","v":"-"},{"$f":"IF(B105=\"-\",\"-\",F104*(1+CALCULOS!$C$27)+E105)","v":"-"},"-"]
[null,{"$f":"IF(OR(B105>=CALCULOS!$F$18,B105=\"-\"),\"-\",B105+1)","v":"-"},{"$f":"IF(B106=\"-\",\"-\",CALCULOS!$F$14+B106)","v":"-"},{"$f":"IF(B106=\"-\",\"-\",D105*(1+CALCULOS!$C$27))","v":"-"},{"$f":"IF(B106=\"-\",\"-\",IF(B106=1,CALCULOS!$C$47,IF(MOD(B105,12)=0,E104*(1+CALCULOS!$C$28),E105))*IF(MOD(B106,12)=0,2,1))","v":"-"},{"$f":"IF(B106=\"-\",\"-\",F105*(1+CALCULOS!$C$27)+E106)","v":"-"},"-"]
[null,{"$f":"IF(OR(B106>=CALCULOS!$F$18,B106=\"-\"),\"-\",B106+1)","v":"-"},{"$f":"IF(B107=\"-\",\"-\",CALCULOS!$F$14+B107)","v":"-"},{"$f":"IF(B107=\"-\",\"-\",D106*(1+CALCULOS!$C$27))","v":"-"},{"$f":"IF(B107=\"-\",\"-\",IF(B107=1,CALCULOS!$C$47,IF(MOD(B106,12)=0,E105*(1+CALCULOS!$C$28),E106))*IF(MOD(B107,12)=0,2,1))","v":"-"},{"$f":"IF(B107=\"-\",\"-\",F106*(1+CALCULOS!$C$27)+E107)","v":"-"},"-"]
[null,{"$f":"IF(OR(B107>=CALCULOS!$F$18,B107=\"-\"),\"-\",B107+1)","v":"-"},{"$f":"IF(B108=\"-\",\"-\",CALCULOS!$F$14+B108)","v":"-"},{"$f":"IF(B108=\"-\",\"-\",D107*(1+CALCULOS!$C$27))","v":"-"},{"$f":"IF(B108=\"-\",\"-\",IF(B108=1,CALCULOS!$C$47,IF(MOD(B107,12)=0,E106*(1+CALCULOS!$C$28),E107))*IF(MOD(B108,12)=0,2,1))","v":"-"},{"$f":"IF(B108=\"-\",\"-\",F107*(1+CALCULOS!$C$27)+E108)","v":"-"},"-"]
[null,{"$f":"IF(OR(B108>=CALCULOS!$F$18,B108=\"-\"),\"-\",B108+1)","v":"-"},{"$f":"IF(B109=\"-\",\"-\",CALCULOS!$F$14+B109)","v":"-"},{"$f":"IF(B109=\"-\",\"-\",D108*(1+CALCULOS!$C$27))","v":"-"},{"$f":"IF(B109=\"-\",\"-\",IF(B109=1,CALCULOS!$C$47,IF(MOD(B108,12)=0,E107*(1+CALCULOS!$C$28),E108))*IF(MOD(B109,12)=0,2,1))","v":"-"},{"$f":"IF(B109=\"-\",\"-\",F108*(1+CALCULOS!$C$27)+E109)","v":"-"},"-"]
[null,{"$f":"IF(OR(B109>=CALCULOS!$F$18,B109=\"-\"),\"-\",B109+1)","v":"-"},{"$f":"IF(B110=\"-\",\"-\",CALCULOS!$F$14+B110)","v":"-"},{"$f":"IF(B110=\"-\",\"-\",D109*(1+CALCULOS!$C$27))","v":"-"},{"$f":"IF(B110=\"-\",\"-\",IF(B110=1,CALCULOS!$C$47,IF(MOD(B109,12)=0,E108*(1+CALCULOS!$C$28),E109))*IF(MOD(B110,12)=0,2,1))","v":"-"},{"$f":"IF(B110=\"-\",\"-\",F109*(1+CALCULOS!$C$27)+E110)","v":"-"},"-"]
[null,{"$f":"IF(OR(B110>=CALCULOS!$F$18,B110=\"-\"),\"-\",B110+1)","v":"-"},{"$f":"IF(B111=\"-\",\"-\",CALCULOS!$F$14+B111)","v":"-"},{"$f":"IF(B111=\"-\",\"-\",D110*(1+CALCULOS!$C$27))","v":"-"},{"$f":"IF(B111=\"-\",\"-\",IF(B111=1,CALCULOS!$C$47,IF(MOD(B110,12)=0,E109*(1+CALCULOS!$C$28),E110))*IF(MOD(B111,12)=0,2,1))","v":"-"},{"$f":"IF(B111=\"-\",\"-\",F110*(1+CALCULOS!$C$27)+E111)","v":"-"},"-"]
[null,{"$f":"IF(OR(B111>=CALCULOS!$F$18,B111=\"-\"),\"-\",B111+1)","v":"-"},{"$f":"IF(B112=\"-\",\"-\",CALCULOS!$F$14+B112)","v":"-"},{"$f":"IF(B112=\"-\",\"-\",D111*(1+CALCULOS!$C$27))","v":"-"},{"$f":"IF(B112=\"-\",\"-\",IF(B112=1,CALCULOS!$C$47,IF(MOD(B111,12)=0,E110*(1+CALCULOS!$C$28),E111))*IF(MOD(B112,12)=0,2,1))","v":"-"},{"$f":"IF(B112=\"-\",\"-\",F111*(1+CALCULOS!$C$27)+E112)","v":"-"},"-"]
[null,{"$f":"IF(OR(B112>=CALCULOS!$F$18,B112=\"-\"),\"-\",B112+1)","v":"-"},{"$f":"IF(B113=\"-\",\"-\",CALCULOS!$F$14+B113)","v":"-"},{"$f":"IF(B113=\"-\",\"-\",D112*(1+CALCULOS!$C$27))","v":"-"},{"$f":"IF(B113=\"-\",\"-\",IF(B113=1,CALCULOS!$C$47,IF(MOD(B112,12)=0,E111*(1+CALCULOS!$C$28),E112))*IF(MOD(B113,12)=0,2,1))","v":"-"},{"$f":"IF(B113=\"-\",\"-\",F112*(1+CALCULOS!$C$27)+E113)","v":"-"},"-"]
[null,{"$f":"IF(OR(B113>=CALCULOS!$F$18,B113=\"-\"),\"-\",B113+1)","v":"-"},{"$f":"IF(B114=\"-\",\"-\",CALCULOS!$F$14+B114)","v":"-"},{"$f":"IF(B114=\"-\",\"-\",D113*(1+CALCULOS!$C$27))","v":"-"},{"$f":"IF(B114=\"-\",\"-\",IF(B114=1,CALCULOS!$C$47,IF(MOD(B113,12)=0,E112*(1+CALCULOS!$C$28),E113))*IF(MOD(B114,12)=0,2,1))","v":"-"},{"$f":"IF(B114=\"-\",\"-\",F113*(1+CALCULOS!$C$27)+E114)","v":"-"},"-"]
[null,{"$f":"IF(OR(B114>=CALCULOS!$F$18,B114=\"-\"),\"-\",B114+1)","v":"-"},{"$f":"IF(B115=\"-\",\"-\",CALCULOS!$F$14+B115)","v":"-"},{"$f":"IF(B115=\"-\",\"-\",D114*(1+CALCULOS!$C$27))","v":"-"},{"$f":"IF(B115=\"-\",\"-\",IF(B115=1,CALCULOS!$C$47,IF(MOD(B114,12)=0,E113*(1+CALCULOS!$C$28),E114))*IF(MOD(B115,12)=0,2,1))","v":"-"},{"$f":"IF(B115=\"-\",\"-\",F114*(1+CALCULOS!$C$27)+E115)","v":"-"},"-"]
[null,{"$f":"IF(OR(B115>=CALCULOS!$F$18,B115=\"-\"),\"-\",B115+1)","v":"-"},{"$f":"IF(B116=\"-\",\"-\",CALCULOS!$F$14+B116)","v":"-"},{"$f":"IF(B116=\"-\",\"-\",D115*(1+CALCULOS!$C$27))","v":"-"},{"$f":"IF(B116=\"-\",\"-\",IF(B116=1,CALCULOS!$C$47,IF(MOD(B115,12)=0,E114*(1+CALCULOS!$C$28),E115))*IF(MOD(B116,12)=0,2,1))","v":"-"},{"$f":"IF(B116=\"-\",\"-\",F115*(1+CALCULOS!$C$27)+E116)","v":"-"},"-"]
[null,{"$f":"IF(OR(B116>=CALCULOS!$F$18,B116=\"-\"),\"-\",B116+1)","v":"-"},{"$f":"IF(B117=\"-\",\"-\",CALCULOS!$F$14+B117)","v":"-"},{"$f":"IF(B117=\"-\",\"-\",D116*(1+CALCULOS!$C$27))","v":"-"},{"$f":"IF(B117=\"-\",\"-\",IF(B117=1,CALCULOS!$C$47,IF(MOD(B116,12)=0,E115*(1+CALCULOS!$C$28),E116))*IF(MOD(B117,12)=0,2,1))","v":"-"},{"$f":"IF(B117=\"-\",\"-\",F116*(1+CALCULOS!$C$27)+E117)","v":"-"},"-"]
[null,{"$f":"IF(OR(B117>=CALCULOS!$F$18,B117=\"-\"),\"-\",B117+1)","v":"-"},{"$f":"IF(B118=\"-\",\"-\",CALCULOS!$F$14+B118)","v":"-"},{"$f":"IF(B118=\"-\",\"-\",D117*(1+CALCULOS!$C$27))","v":"-"},{"$f":"IF(B118=\"-\",\"-\",IF(B118=1,CALCULOS!$C$47,IF(MOD(B117,12)=0,E116*(1+CALCULOS!$C$28),E117))*IF(MOD(B118,12)=0,2,1))","v":"-"},{"$f":"IF(B118=\"-\",\"-\",F117*(1+CALCULOS!$C$27)+E118)","v":"-"},"-"]
[null,{"$f":"IF(OR(B118>=CALCULOS!$F$18,B118=\"-\"),\"-\",B118+1)","v":"-"},{"$f":"IF(B119=\"-\",\"-\",CALCULOS!$F$14+B119)","v":"-"},{"$f":"IF(B119=\"-\",\"-\",D118*(1+CALCULOS!$C$27))","v":"-"},{"$f":"IF(B119=\"-\",\"-\",IF(B119=1,CALCULOS!$C$47,IF(MOD(B118,12)=0,E117*(1+CALCULOS!$C$28),E118))*IF(MOD(B119,12)=0,2,1))","v":"-"},{"$f":"IF(B119=\"-\",\"-\",F118*(1+CALCULOS!$C$27)+E119)","v":"-"},"-"]
[null,{"$f":"IF(OR(B119>=CALCULOS!$F$18,B119=\"-\"),\"-\",B119+1)","v":"-"},{"$f":"IF(B120=\"-\",\"-\",CALCULOS!$F$14+B120)","v":"-"},{"$f":"IF(B120=\"-\",\"-\",D119*(1+CALCULOS!$C$27))","v":"-"},{"$f":"IF(B120=\"-\",\"-\",IF(B120=1,CALCULOS!$C$47,IF(MOD(B119,12)=0,E118*(1+CALCULOS!$C$28),E119))*IF(MOD(B120,12)=0,2,1))","v":"-"},{"$f":"IF(B120=\"-\",\"-\",F119*(1+CALCULOS!$C$27)+E120)","v":"-"},"-"]
[null,{"$f":"IF(OR(B120>=CALCULOS!$F$18,B120=\"-\"),\"-\",B120+1)","v":"-"},{"$f":"IF(B121=\"-\",\"-\",CALCULOS!$F$14+B121)","v":"-"},{"$f":"IF(B121=\"-\",\"-\",D120*(1+CALCULOS!$C$27))","v":"-"},{"$f":"IF(B121=\"-\",\"-\",IF(B121=1,CALCULOS!$C$47,IF(MOD(B120,12)=0,E119*(1+CALCULOS!$C$28),E120))*IF(MOD(B121,12)=0,2,1))","v":"-"},{"$f":"IF(B121=\"-\",\"-\",F120*(1+CALCULOS!$C$27)+E121)","v":"-"},"-"]
[null,{"$f":"IF(OR(B121>=CALCULOS!$F$18,B121=\"-\"),\"-\",B121+1)","v":"-"},{"$f":"IF(B122=\"-\",\"-\",CALCULOS!$F$14+B122)","v":"-"},{"$f":"IF(B122=\"-\",\"-\",D121*(1+CALCULOS!$C$27))","v":"-"},{"$f":"IF(B122=\"-\",\"-\",IF(B122=1,CALCULOS!$C$47,IF(MOD(B121,12)=0,E120*(1+CALCULOS!$C$28),E121))*IF(MOD(B122,12)=0,2,1))","v":"-"},{"$f":"IF(B122=\"-\",\"-\",F121*(1+CALCULOS!$C$27)+E122)","v":"-"},"-"]
[null,{"$f":"IF(OR(B122>=CALCULOS!$F$18,B122=\"-\"),\"-\",B122+1)","v":"-"},{"$f":"IF(B123=\"-\",\"-\",CALCULOS!$F$14+B123)","v":"-"},{"$f":"IF(B123=\"-\",\"-\",D122*(1+CALCULOS!$C$27))","v":"-"},{"$f":"IF(B123=\"-\",\"-\",IF(B123=1,CALCULOS!$C$47,IF(MOD(B122,12)=0,E121*(1+CALCULOS!$C$28),E122))*IF(MOD(B123,12)=0,2,1))","v":"-"},{"$f":"IF(B123=\"-\",\"-\",F122*(1+CALCULOS!$C$27)+E123)","v":"-"},"-"]
[null,{"$f":"IF(OR(B123>=CALCULOS!$F$18,B123=\"-\"),\"-\",B123+1)","v":"-"},{"$f":"IF(B124=\"-\",\"-\",CALCULOS!$F$14+B124)","v":"-"},{"$f":"IF(B124=\"-\",\"-\",D123*(1+CALCULOS!$C$27))","v":"-"},{"$f":"IF(B124=\"-\",\"-\",IF(B124=1,CALCULOS!$C$47,IF(MOD(B123,12)=0,E122*(1+CALCULOS!$C$28),E123))*IF(MOD(B124,12)=0,2,1))","v":"-"},{"$f":"IF(B124=\"-\",\"-\",F123*(1+CALCULOS!$C$27)+E124)","v":"-"},"-"]
[null,{"$f":"IF(OR(B124>=CALCULOS!$F$18,B124=\"-\"),\"-\",B124+1)","v":"-"},{"$f":"IF(B125=\"-\",\"-\",CALCULOS!$F$14+B125)","v":"-"},{"$f":"IF(B125=\"-\",\"-\",D124*(1+CALCULOS!$C$27))","v":"-"},{"$f":"IF(B125=\"-\",\"-\",IF(B125=1,CALCULOS!$C$47,IF(MOD(B124,12)=0,E123*(1+CALCULOS!$C$28),E124))*IF(MOD(B125,12)=0,2,1))","v":"-"},{"$f":"IF(B125=\"-\",\"-\",F124*(1+CALCULOS!$C$27)+E125)","v":"-"},"-"]
[null,{"$f":"IF(OR(B125>=CALCULOS!$F$18,B125=\"-\"),\"-\",B125+1)","v":"-"},{"$f":"IF(B126=\"-\",\"-\",CALCULOS!$F$14+B126)","v":"-"},{"$f":"IF(B126=\"-\",\"-\",D125*(1+CALCULOS!$C$27))","v":"-"},{"$f":"IF(B126=\"-\",\"-\",IF(B126=1,CALCULOS!$C$47,IF(MOD(B125,12)=0,E124*(1+CALCULOS!$C$28),E125))*IF(MOD(B126,12)=0,2,1))","v":"-"},{"$f":"IF(B126=\"-\",\"-\",F125*(1+CALCULOS!$C$27)+E126)","v":"-"},"-"]
[null,{"$f":"IF(OR(B126>=CALCULOS!$F$18,B126=\"-\"),\"-\",B126+1)","v":"-"},{"$f":"IF(B127=\"-\",\"-\",CALCULOS!$F$14+B127)","v":"-"},{"$f":"IF(B127=\"-\",\"-\",D126*(1+CALCULOS!$C$27))","v":"-"},{"$f":"IF(B127=\"-\",\"-\",IF(B127=1,CALCULOS!$C$47,IF(MOD(B126,12)=0,E125*(1+CALCULOS!$C$28),E126))*IF(MOD(B127,12)=0,2,1))","v":"-"},{"$f":"IF(B127=\"-\",\"-\",F126*(1+CALCULOS!$C$27)+E127)","v":"-"},"-"]
[null,{"$f":"IF(OR(B127>=CALCULOS!$F$18,B127=\"-\"),\"-\",B127+1)","v":"-"},{"$f":"IF(B128=\"-\",\"-\",CALCULOS!$F$14+B128)","v":"-"},{"$f":"IF(B128=\"-\",\"-\",D127*(1+CALCULOS!$C$27))","v":"-"},{"$f":"IF(B128=\"-\",\"-\",IF(B128=1,CALCULOS!$C$47,IF(MOD(B127,12)=0,E126*(1+CALCULOS!$C$28),E127))*IF(MOD(B128,12)=0,2,1))","v":"-"},{"$f":"IF(B128=\"-\",\"-\",F127*(1+CALCULOS!$C$27)+E128)","v":"-"},"-"]
[null,{"$f":"IF(OR(B128>=CALCULOS!$F$18,B128=\"-\"),\"-\",B128+1)","v":"-"},{"$f":"IF(B129=\"-\",\"-\",CALCULOS!$F$14+B129)","v":"-"},{"$f":"IF(B129=\"-\",\"-\",D128*(1+CALCULOS!$C$27))","v":"-"},{"$f":"IF(B129=\"-\",\"-\",IF(B129=1,CALCULOS!$C$47,IF(MOD(B128,12)=0,E127*(1+CALCULOS!$C$28),E128))*IF(MOD(B129,12)=0,2,1))","v":"-"},{"$f":"IF(B129=\"-\",\"-\",F128*(1+CALCULOS!$C$27)+E129)","v":"-"},"-"]
[null,{"$f":"IF(OR(B129>=CALCULOS!$F$18,B129=\"-\"),\"-\",B129+1)","v":"-"},{"$f":"IF(B130=\"-\",\"-\",CALCULOS!$F$14+B130)","v":"-"},{"$f":"IF(B130=\"-\",\"-\",D129*(1+CALCULOS!$C$27))","v":"-"},{"$f":"IF(B130=\"-\",\"-\",IF(B130=1,CALCULOS!$C$47,IF(MOD(B129,12)=0,E128*(1+CALCULOS!$C$28),E129))*IF(MOD(B130,12)=0,2,1))","v":"-"},{"$f":"IF(B130=\"-\",\"-\",F129*(1+CALCULOS!$C$27)+E130)","v":"-"},"-"]
[null,{"$f":"IF(OR(B130>=CALCULOS!$F$18,B130=\"-\"),\"-\",B130+1)","v":"-"},{"$f":"IF(B131=\"-\",\"-\",CALCULOS!$F$14+B131)","v":"-"},{"$f":"IF(B131=\"-\",\"-\",D130*(1+CALCULOS!$C$27))","v":"-"},{"$f":"IF(B131=\"-\",\"-\",IF(B131=1,CALCULOS!$C$47,IF(MOD(B130,12)=0,E129*(1+CALCULOS!$C$28),E130))*IF(MOD(B131,12)=0,2,1))","v":"-"},{"$f":"IF(B131=\"-\",\"-\",F130*(1+CALCULOS!$C$27)+E131)","v":"-"},"-"]
[null,{"$f":"IF(OR(B131>=CALCULOS!$F$18,B131=\"-\"),\"-\",B131+1)","v":"-"},{"$f":"IF(B132=\"-\",\"-\",CALCULOS!$F$14+B132)","v":"-"},{"$f":"IF(B132=\"-\",\"-\",D131*(1+CALCULOS!$C$27))","v":"-"},{"$f":"IF(B132=\"-\",\"-\",IF(B132=1,CALCULOS!$C$47,IF(MOD(B131,12)=0,E130*(1+CALCULOS!$C$28),E131))*IF(MOD(B132,12)=0,2,1))","v":"-"},{"$f":"IF(B132=\"-\",\"-\",F131*(1+CALCULOS!$C$27)+E132)","v":"-"},"-"]
[null,{"$f":"IF(OR(B132>=CALCULOS!$F$18,B132=\"-\"),\"-\",B132+1)","v":"-"},{"$f":"IF(B133=\"-\",\"-\",CALCULOS!$F$14+B133)","v":"-"},{"$f":"IF(B133=\"-\",\"-\",D132*(1+CALCULOS!$C$27))","v":"-"},{"$f":"IF(B133=\"-\",\"-\",IF(B133=1,CALCULOS!$C$47,IF(MOD(B132,12)=0,E131*(1+CALCULOS!$C$28),E132))*IF(MOD(B133,12)=0,2,1))","v":"-"},{"$f":"IF(B133=\"-\",\"-\",F132*(1+CALCULOS!$C$27)+E133)","v":"-"},"-"]
[null,{"$f":"IF(OR(B133>=CALCULOS!$F$18,B133=\"-\"),\"-\",B133+1)","v":"-"},{"$f":"IF(B134=\"-\",\"-\",CALCULOS!$F$14+B134)","v":"-"},{"$f":"IF(B134=\"-\",\"-\",D133*(1+CALCULOS!$C$27))","v":"-"},{"$f":"IF(B134=\"-\",\"-\",IF(B134=1,CALCULOS!$C$47,IF(MOD(B133,12)=0,E132*(1+CALCULOS!$C$28),E133))*IF(MOD(B134,12)=0,2,1))","v":"-"},{"$f":"IF(B134=\"-\",\"-\",F133*(1+CALCULOS!$C$27)+E134)","v":"-"},"-"]
[null,{"$f":"IF(OR(B134>=CALCULOS!$F$18,B134=\"-\"),\"-\",B134+1)","v":"-"},{"$f":"IF(B135=\"-\",\"-\",CALCULOS!$F$14+B135)","v":"-"},{"$f":"IF(B135=\"-\",\"-\",D134*(1+CALCULOS!$C$27))","v":"-"},{"$f":"IF(B135=\"-\",\"-\",IF(B135=1,CALCULOS!$C$47,IF(MOD(B134,12)=0,E133*(1+CALCULOS!$C$28),E134))*IF(MOD(B135,12)=0,2,1))","v":"-"},{"$f":"IF(B135=\"-\",\"-\",F134*(1+CALCULOS!$C$27)+E135)","v":"-"},"-"]
[null,{"$f":"IF(OR(B135>=CALCULOS!$F$18,B135=\"-\"),\"-\",B135+1)","v":"-"},{"$f":"IF(B136=\"-\",\"-\",CALCULOS!$F$14+B136)","v":"-"},{"$f":"IF(B136=\"-\",\"-\",D135*(1+CALCULOS!$C$27))","v":"-"},{"$f":"IF(B136=\"-\",\"-\",IF(B136=1,CALCULOS!$C$47,IF(MOD(B135,12)=0,E134*(1+CALCULOS!$C$28),E135))*IF(MOD(B136,12)=0,2,1))","v":"-"},{"$f":"IF(B136=\"-\",\"-\",F135*(1+CALCULOS!$C$27)+E136)","v":"-"},"-"]
[null,{"$f":"IF(OR(B136>=CALCULOS!$F$18,B136=\"-\"),\"-\",B136+1)","v":"-"},{"$f":"IF(B137=\"-\",\"-\",CALCULOS!$F$14+B137)","v":"-"},{"$f":"IF(B137=\"-\",\"-\",D136*(1+CALCULOS!$C$27))","v":"-"},{"$f":"IF(B137=\"-\",\"-\",IF(B137=1,CALCULOS!$C$47,IF(MOD(B136,12)=0,E135*(1+CALCULOS!$C$28),E136))*IF(MOD(B137,12)=0,2,1))","v":"-"},{"$f":"IF(B137=\"-\",\"-\",F136*(1+CALCULOS!$C$27)+E137)","v":"-"},"-"]
[null,{"$f":"IF(OR(B137>=CALCULOS!$F$18,B137=\"-\"),\"-\",B137+1)","v":"-"},{"$f":"IF(B138=\"-\",\"-\",CALCULOS!$F$14+B138)","v":"-"},{"$f":"IF(B138=\"-\",\"-\",D137*(1+CALCULOS!$C$27))","v":"-"},{"$f":"IF(B138=\"-\",\"-\",IF(B138=1,CALCULOS!$C$47,IF(MOD(B137,12)=0,E136*(1+CALCULOS!$C$28),E137))*IF(MOD(B138,12)=0,2,1))","v":"-"},{"$f":"IF(B138=\"-\",\"-\",F137*(1+CALCULOS!$C$27)+E138)","v":"-"},{"$f":"IF(B138=\"-\",\"-\",SUM(D138,F138))","v":"-"}]
[null,{"$f":"IF(OR(B138>=CALCULOS!$F$18,B138=\"-\"),\"-\",B138+1)","v":"-"},{"$f":"IF(B139=\"-\",\"-\",CALCULOS!$F$14+B139)","v":"-"},{"$f":"IF(B139=\"-\",\"-\",D138*(1+CALCULOS!$C$27))","v":"-"},{"$f":"IF(B139=\"-\",\"-\",IF(B139=1,CALCULOS!$C$47,IF(MOD(B138,12)=0,E137*(1+CALCULOS!$C$28),E138))*IF(MOD(B139,12)=0,2,1))","v":"-"},{"$f":"IF(B139=\"-\",\"-\",F138*(1+CALCULOS!$C$27)+E139)","v":"-"},"-"]
[null,{"$f":"IF(OR(B139>=CALCULOS!$F$18,B139=\"-\"),\"-\",B139+1)","v":"-"},{"$f":"IF(B140=\"-\",\"-\",CALCULOS!$F$14+B140)","v":"-"},{"$f":"IF(B140=\"-\",\"-\",D139*(1+CALCULOS!$C$27))","v":"-"},{"$f":"IF(B140=\"-\",\"-\",IF(B140=1,CALCULOS!$C$47,IF(MOD(B139,12)=0,E138*(1+CALCULOS!$C$28),E139))*IF(MOD(B140,12)=0,2,1))","v":"-"},{"$f":"IF(B140=\"-\",\"-\",F139*(1+CALCULOS!$C$27)+E140)","v":"-"},"-"]
[null,{"$f":"IF(OR(B140>=CALCULOS!$F$18,B140=\"-\"),\"-\",B140+1)","v":"-"},{"$f":"IF(B141=\"-\",\"-\",CALCULOS!$F$14+B141)","v":"-"},{"$f":"IF(B141=\"-\",\"-\",D140*(1+CALCULOS!$C$27))","v":"-"},{"$f":"IF(B141=\"-\",\"-\",IF(B141=1,CALCULOS!$C$47,IF(MOD(B140,12)=0,E139*(1+CALCULOS!$C$28),E140))*IF(MOD(B141,12)=0,2,1))","v":"-"},{"$f":"IF(B141=\"-\",\"-\",F140*(1+CALCULOS!$C$27)+E141)","v":"-"},"-"]
[null,{"$f":"IF(OR(B141>=CALCULOS!$F$18,B141=\"-\"),\"-\",B141+1)","v":"-"},{"$f":"IF(B142=\"-\",\"-\",CALCULOS!$F$14+B142)","v":"-"},{"$f":"IF(B142=\"-\",\"-\",D141*(1+CALCULOS!$C$27))","v":"-"},{"$f":"IF(B142=\"-\",\"-\",IF(B142=1,CALCULOS!$C$47,IF(MOD(B141,12)=0,E140*(1+CALCULOS!$C$28),E141))*IF(MOD(B142,12)=0,2,1))","v":"-"},{"$f":"IF(B142=\"-\",\"-\",F141*(1+CALCULOS!$C$27)+E142)","v":"-"},"-"]
[null,{"$f":"IF(OR(B142>=CALCULOS!$F$18,B142=\"-\"),\"-\",B142+1)","v":"-"},{"$f":"IF(B143=\"-\",\"-\",CALCULOS!$F$14+B143)","v":"-"},{"$f":"IF(B143=\"-\",\"-\",D142*(1+CALCULOS!$C$27))","v":"-"},{"$f":"IF(B143=\"-\",\"-\",IF(B143=1,CALCULOS!$C$47,IF(MOD(B142,12)=0,E141*(1+CALCULOS!$C$28),E142))*IF(MOD(B143,12)=0,2,1))","v":"-"},{"$f":"IF(B143=\"-\",\"-\",F142*(1+CALCULOS!$C$27)+E143)","v":"-"},"-"]
[null,{"$f":"IF(OR(B143>=CALCULOS!$F$18,B143=\"-\"),\"-\",B143+1)","v":"-"},{"$f":"IF(B144=\"-\",\"-\",CALCULOS!$F$14+B144)","v":"-"},{"$f":"IF(B144=\"-\",\"-\",D143*(1+CALCULOS!$C$27))","v":"-"},{"$f":"IF(B144=\"-\",\"-\",IF(B144=1,CALCULOS!$C$47,IF(MOD(B143,12)=0,E142*(1+CALCULOS!$C$28),E143))*IF(MOD(B144,12)=0,2,1))","v":"-"},{"$f":"IF(B144=\"-\",\"-\",F143*(1+CALCULOS!$C$27)+E144)","v":"-"},"-"]
[null,{"$f":"IF(OR(B144>=CALCULOS!$F$18,B144=\"-\"),\"-\",B144+1)","v":"-"},{"$f":"IF(B145=\"-\",\"-\",CALCULOS!$F$14+B145)","v":"-"},{"$f":"IF(B145=\"-\",\"-\",D144*(1+CALCULOS!$C$27))","v":"-"},{"$f":"IF(B145=\"-\",\"-\",IF(B145=1,CALCULOS!$C$47,IF(MOD(B144,12)=0,E143*(1+CALCULOS!$C$28),E144))*IF(MOD(B145,12)=0,2,1))","v":"-"},{"$f":"IF(B145=\"-\",\"-\",F144*(1+CALCULOS!$C$27)+E145)","v":"-"},"-"]
[null,{"$f":"IF(OR(B145>=CALCULOS!$F$18,B145=\"-\"),\"-\",B145+1)","v":"-"},{"$f":"IF(B146=\"-\",\"-\",CALCULOS!$F$14+B146)","v":"-"},{"$f":"IF(B146=\"-\",\"-\",D145*(1+CALCULOS!$C$27))","v":"-"},{"$f":"IF(B146=\"-\",\"-\",IF(B146=1,CALCULOS!$C$47,IF(MOD(B145,12)=0,E144*(1+CALCULOS!$C$28),E145))*IF(MOD(B146,12)=0,2,1))","v":"-"},{"$f":"IF(B146=\"-\",\"-\",F145*(1+CALCULOS!$C$27)+E146)","v":"-"},"-"]
[null,{"$f":"IF(OR(B146>=CALCULOS!$F$18,B146=\"-\"),\"-\",B146+1)","v":"-"},{"$f":"IF(B147=\"-\",\"-\",CALCULOS!$F$14+B147)","v":"-"},{"$f":"IF(B147=\"-\",\"-\",D146*(1+CALCULOS!$C$27))","v":"-"},{"$f":"IF(B147=\"-\",\"-\",IF(B147=1,CALCULOS!$C$47,IF(MOD(B146,12)=0,E145*(1+CALCULOS!$C$28),E146))*IF(MOD(B147,12)=0,2,1))","v":"-"},{"$f":"IF(B147=\"-\",\"-\",F146*(1+CALCULOS!$C$27)+E147)","v":"-"},{"$f":"IF(B147=\"-\",\"-\",SUM(D147,F147))","v":"-"}]
[null,{"$f":"IF(OR(B147>=CALCULOS!$F$18,B147=\"-\"),\"-\",B147+1)","v":"-"},{"$f":"IF(B148=\"-\",\"-\",CALCULOS!$F$14+B148)","v":"-"},{"$f":"IF(B148=\"-\",\"-\",D147*(1+CALCULOS!$C$27))","v":"-"},{"$f":"IF(B148=\"-\",\"-\",IF(B148=1,CALCULOS!$C$47,IF(MOD(B147,12)=0,E146*(1+CALCULOS!$C$28),E147))*IF(MOD(B148,12)=0,2,1))","v":"-"},{"$f":"IF(B148=\"-\",\"-\",F147*(1+CALCULOS!$C$27)+E148)","v":"-"},{"$f":"IF(B148=\"-\",\"-\",SUM(D148,F148))","v":"-"}]
[null,{"$f":"IF(OR(B148>=CALCULOS!$F$18,B148=\"-\"),\"-\",B148+1)","v":"-"},{"$f":"IF(B149=\"-\",\"-\",CALCULOS!$F$14+B149)","v":"-"},{"$f":"IF(B149=\"-\",\"-\",D148*(1+CALCULOS!$C$27))","v":"-"},{"$f":"IF(B149=\"-\",\"-\",IF(B149=1,CALCULOS!$C$47,IF(MOD(B148,12)=0,E147*(1+CALCULOS!$C$28),E148))*IF(MOD(B149,12)=0,2,1))","v":"-"},{"$f":"IF(B149=\"-\",\"-\",F148*(1+CALCULOS!$C$27)+E149)","v":"-"},"-"]
[null,{"$f":"IF(OR(B149>=CALCULOS!$F$18,B149=\"-\"),\"-\",B149+1)","v":"-"},{"$f":"IF(B150=\"-\",\"-\",CALCULOS!$F$14+B150)","v":"-"},{"$f":"IF(B150=\"-\",\"-\",D149*(1+CALCULOS!$C$27))","v":"-"},{"$f":"IF(B150=\"-\",\"-\",IF(B150=1,CALCULOS!$C$47,IF(MOD(B149,12)=0,E148*(1+CALCULOS!$C$28),E149))*IF(MOD(B150,12)=0,2,1))","v":"-"},{"$f":"IF(B150=\"-\",\"-\",F149*(1+CALCULOS!$C$27)+E150)","v":"-"},"-"]
[null,{"$f":"IF(OR(B150>=CALCULOS!$F$18,B150=\"-\"),\"-\",B150+1)","v":"-"},{"$f":"IF(B151=\"-\",\"-\",CALCULOS!$F$14+B151)","v":"-"},{"$f":"IF(B151=\"-\",\"-\",D150*(1+CALCULOS!$C$27))","v":"-"},{"$f":"IF(B151=\"-\",\"-\",IF(B151=1,CALCULOS!$C$47,IF(MOD(B150,12)=0,E149*(1+CALCULOS!$C$28),E150))*IF(MOD(B151,12)=0,2,1))","v":"-"},{"$f":"IF(B151=\"-\",\"-\",F150*(1+CALCULOS!$C$27)+E151)","v":"-"},"-"]
[null,{"$f":"IF(OR(B151>=CALCULOS!$F$18,B151=\"-\"),\"-\",B151+1)","v":"-"},{"$f":"IF(B152=\"-\",\"-\",CALCULOS!$F$14+B152)","v":"-"},{"$f":"IF(B152=\"-\",\"-\",D151*(1+CALCULOS!$C$27))","v":"-"},{"$f":"IF(B152=\"-\",\"-\",IF(B152=1,CALCULOS!$C$47,IF(MOD(B151,12)=0,E150*(1+CALCULOS!$C$28),E151))*IF(MOD(B152,12)=0,2,1))","v":"-"},{"$f":"IF(B152=\"-\",\"-\",F151*(1+CALCULOS!$C$27)+E152)","v":"-"},"-"]
[null,{"$f":"IF(OR(B152>=CALCULOS!$F$18,B152=\"-\"),\"-\",B152+1)","v":"-"},{"$f":"IF(B153=\"-\",\"-\",CALCULOS!$F$14+B153)","v":"-"},{"$f":"IF(B153=\"-\",\"-\",D152*(1+CALCULOS!$C$27))","v":"-"},{"$f":"IF(B153=\"-\",\"-\",IF(B153=1,CALCULOS!$C$47,IF(MOD(B152,12)=0,E151*(1+CALCULOS!$C$28),E152))*IF(MOD(B153,12)=0,2,1))","v":"-"},{"$f":"IF(B153=\"-\",\"-\",F152*(1+CALCULOS!$C$27)+E153)","v":"-"},{"$f":"IF(B153=\"-\",\"-\",SUM(D153,F153))","v":"-"}]
[null,{"$f":"IF(OR(B153>=CALCULOS!$F$18,B153=\"-\"),\"-\",B153+1)","v":"-"},{"$f":"IF(B154=\"-\",\"-\",CALCULOS!$F$14+B154)","v":"-"},{"$f":"IF(B154=\"-\",\"-\",D153*(1+CALCULOS!$C$27))","v":"-"},{"$f":"IF(B154=\"-\",\"-\",IF(B154=1,CALCULOS!$C$47,IF(MOD(B153,12)=0,E152*(1+CALCULOS!$C$28),E153))*IF(MOD(B154,12)=0,2,1))","v":"-"},{"$f":"IF(B154=\"-\",\"-\",F153*(1+CALCULOS!$C$27)+E154)","v":"-"},"-"]
[null,{"$f":"IF(OR(B154>=CALCULOS!$F$18,B154=\"-\"),\"-\",B154+1)","v":"-"},{"$f":"IF(B155=\"-\",\"-\",CALCULOS!$F$14+B155)","v":"-"},{"$f":"IF(B155=\"-\",\"-\",D154*(1+CALCULOS!$C$27))","v":"-"},{"$f":"IF(B155=\"-\",\"-\",IF(B155=1,CALCULOS!$C$47,IF(MOD(B154,12)=0,E153*(1+CALCULOS!$C$28),E154))*IF(MOD(B155,12)=0,2,1))","v":"-"},{"$f":"IF(B155=\"-\",\"-\",F154*(1+CALCULOS!$C$27)+E155)","v":"-"},"-"]
[null,{"$f":"IF(OR(B155>=CALCULOS!$F$18,B155=\"-\"),\"-\",B155+1)","v":"-"},{"$f":"IF(B156=\"-\",\"-\",CALCULOS!$F$14+B156)","v":"-"},{"$f":"IF(B156=\"-\",\"-\",D155*(1+CALCULOS!$C$27))","v":"-"},{"$f":"IF(B156=\"-\",\"-\",IF(B156=1,CALCULOS!$C$47,IF(MOD(B155,12)=0,E154*(1+CALCULOS!$C$28),E155))*IF(MOD(B156,12)=0,2,1))","v":"-"},{"$f":"IF(B156=\"-\",\"-\",F155*(1+CALCULOS!$C$27)+E156)","v":"-"},"-"]
[null,{"$f":"IF(OR(B156>=CALCULOS!$F$18,B156=\"-\"),\"-\",B156+1)","v":"-"},{"$f":"IF(B157=\"-\",\"-\",CALCULOS!$F$14+B157)","v":"-"},{"$f":"IF(B157=\"-\",\"-\",D156*(1+CALCULOS!$C$27))","v":"-"},{"$f":"IF(B157=\"-\",\"-\",IF(B157=1,CALCULOS!$C$47,IF(MOD(B156,12)=0,E155*(1+CALCULOS!$C$28),E156))*IF(MOD(B157,12)=0,2,1))","v":"-"},{"$f":"IF(B157=\"-\",\"-\",F156*(1+CALCULOS!$C$27)+E157)","v":"-"},"-"]
[null,{"$f":"IF(OR(B157>=CALCULOS!$F$18,B157=\"-\"),\"-\",B157+1)","v":"-"},{"$f":"IF(B158=\"-\",\"-\",CALCULOS!$F$14+B158)","v":"-"},{"$f":"IF(B158=\"-\",\"-\",D157*(1+CALCULOS!$C$27))","v":"-"},{"$f":"IF(B158=\"-\",\"-\",IF(B158=1,CALCULOS!$C$47,IF(MOD(B157,12)=0,E156*(1+CALCULOS!$C$28),E157))*IF(MOD(B158,12)=0,2,1))","v":"-"},{"$f":"IF(B158=\"-\",\"-\",F157*(1+CALCULOS!$C$27)+E158)","v":"-"},"-"]
[null,{"$f":"IF(OR(B158>=CALCULOS!$F$18,B158=\"-\"),\"-\",B158+1)","v":"-"},{"$f":"IF(B159=\"-\",\"-\",CALCULOS!$F$14+B159)","v":"-"},{"$f":"IF(B159=\"-\",\"-\",D158*(1+CALCULOS!$C$27))","v":"-"},{"$f":"IF(B159=\"-\",\"-\",IF(B159=1,CALCULOS!$C$47,IF(MOD(B158,12)=0,E157*(1+CALCULOS!$C$28),E158))*IF(MOD(B159,12)=0,2,1))","v":"-"},{"$f":"IF(B159=\"-\",\"-\",F158*(1+CALCULOS!$C$27)+E159)","v":"-"},"-"]
[null,{"$f":"IF(OR(B159>=CALCULOS!$F$18,B159=\"-\"),\"-\",B159+1)","v":"-"},{"$f":"IF(B160=\"-\",\"-\",CALCULOS!$F$14+B160)","v":"-"},{"$f":"IF(B160=\"-\",\"-\",D159*(1+CALCULOS!$C$27))","v":"-"},{"$f":"IF(B160=\"-\",\"-\",IF(B160=1,CALCULOS!$C$47,IF(MOD(B159,12)=0,E158*(1+CALCULOS!$C$28),E159))*IF(MOD(B160,12)=0,2,1))","v":"-"},{"$f":"IF(B160=\"-\",\"-\",F159*(1+CALCULOS!$C$27)+E160)","v":"-"},"-"]
[null,{"$f":"IF(OR(B160>=CALCULOS!$F$18,B160=\"-\"),\"-\",B160+1)","v":"-"},{"$f":"IF(B161=\"-\",\"-\",CALCULOS!$F$14+B161)","v":"-"},{"$f":"IF(B161=\"-\",\"-\",D160*(1+CALCULOS!$C$27))","v":"-"},{"$f":"IF(B161=\"-\",\"-\",IF(B161=1,CALCULOS!$C$47,IF(MOD(B160,12)=0,E159*(1+CALCULOS!$C$28),E160))*IF(MOD(B161,12)=0,2,1))","v":"-"},{"$f":"IF(B161=\"-\",\"-\",F160*(1+CALCULOS!$C$27)+E161)","v":"-"},"-"]
[null,{"$f":"IF(OR(B161>=CALCULOS!$F$18,B161=\"-\"),\"-\",B161+1)","v":"-"},{"$f":"IF(B162=\"-\",\"-\",CALCULOS!$F$14+B162)","v":"-"},{"$f":"IF(B162=\"-\",\"-\",D161*(1+CALCULOS!$C$27))","v":"-"},{"$f":"IF(B162=\"-\",\"-\",IF(B162=1,CALCULOS!$C$47,IF(MOD(B161,12)=0,E160*(1+CALCULOS!$C$28),E161))*IF(MOD(B162,12)=0,2,1))","v":"-"},{"$f":"IF(B162=\"-\",\"-\",F161*(1+CALCULOS!$C$27)+E162)","v":"-"},"-"]
[null,{"$f":"IF(OR(B162>=CALCULOS!$F$18,B162=\"-\"),\"-\",B162+1)","v":"-"},{"$f":"IF(B163=\"-\",\"-\",CALCULOS!$F$14+B163)","v":"-"},{"$f":"IF(B163=\"-\",\"-\",D162*(1+CALCULOS!$C$27))","v":"-"},{"$f":"IF(B163=\"-\",\"-\",IF(B163=1,CALCULOS!$C$47,IF(MOD(B162,12)=0,E161*(1+CALCULOS!$C$28),E162))*IF(MOD(B163,12)=0,2,1))","v":"-"},{"$f":"IF(B163=\"-\",\"-\",F162*(1+CALCULOS!$C$27)+E163)","v":"-"},"-"]
[null,{"$f":"IF(OR(B163>=CALCULOS!$F$18,B163=\"-\"),\"-\",B163+1)","v":"-"},{"$f":"IF(B164=\"-\",\"-\",CALCULOS!$F$14+B164)","v":"-"},{"$f":"IF(B164=\"-\",\"-\",D163*(1+CALCULOS!$C$27))","v":"-"},{"$f":"IF(B164=\"-\",\"-\",IF(B164=1,CALCULOS!$C$47,IF(MOD(B163,12)=0,E162*(1+CALCULOS!$C$28),E163))*IF(MOD(B164,12)=0,2,1))","v":"-"},{"$f":"IF(B164=\"-\",\"-\",F163*(1+CALCULOS!$C$27)+E164)","v":"-"},"-"]
[null,{"$f":"IF(OR(B164>=CALCULOS!$F$18,B164=\"-\"),\"-\",B164+1)","v":"-"},{"$f":"IF(B165=\"-\",\"-\",CALCULOS!$F$14+B165)","v":"-"},{"$f":"IF(B165=\"-\",\"-\",D164*(1+CALCULOS!$C$27))","v":"-"},{"$f":"IF(B165=\"-\",\"-\",IF(B165=1,CALCULOS!$C$47,IF(MOD(B164,12)=0,E163*(1+CALCULOS!$C$28),E164))*IF(MOD(B165,12)=0,2,1))","v":"-"},{"$f":"IF(B165=\"-\",\"-\",F164*(1+CALCULOS!$C$27)+E165)","v":"-"},"-"]
[null,{"$f":"IF(OR(B165>=CALCULOS!$F$18,B165=\"-\"),\"-\",B165+1)","v":"-"},{"$f":"IF(B166=\"-\",\"-\",CALCULOS!$F$14+B166)","v":"-"},{"$f":"IF(B166=\"-\",\"-\",D165*(1+CALCULOS!$C$27))","v":"-"},{"$f":"IF(B166=\"-\",\"-\",IF(B166=1,CALCULOS!$C$47,IF(MOD(B165,12)=0,E164*(1+CALCULOS!$C$28),E165))*IF(MOD(B166,12)=0,2,1))","v":"-"},{"$f":"IF(B166=\"-\",\"-\",F165*(1+CALCULOS!$C$27)+E166)","v":"-"},"-"]
[null,{"$f":"IF(OR(B166>=CALCULOS!$F$18,B166=\"-\"),\"-\",B166+1)","v":"-"},{"$f":"IF(B167=\"-\",\"-\",CALCULOS!$F$14+B167)","v":"-"},{"$f":"IF(B167=\"-\",\"-\",D166*(1+CALCULOS!$C$27))","v":"-"},{"$f":"IF(B167=\"-\",\"-\",IF(B167=1,CALCULOS!$C$47,IF(MOD(B166,12)=0,E165*(1+CALCULOS!$C$28),E166))*IF(MOD(B167,12)=0,2,1))","v":"-"},{"$f":"IF(B167=\"-\",\"-\",F166*(1+CALCULOS!$C$27)+E167)","v":"-"},"-"]
[null,{"$f":"IF(OR(B167>=CALCULOS!$F$18,B167=\"-\"),\"-\",B167+1)","v":"-"},{"$f":"IF(B168=\"-\",\"-\",CALCULOS!$F$14+B168)","v":"-"},{"$f":"IF(B168=\"-\",\"-\",D167*(1+CALCULOS!$C$27))","v":"-"},{"$f":"IF(B168=\"-\",\"-\",IF(B168=1,CALCULOS!$C$47,IF(MOD(B167,12)=0,E166*(1+CALCULOS!$C$28),E167))*IF(MOD(B168,12)=0,2,1))","v":"-"},{"$f":"IF(B168=\"-\",\"-\",F167*(1+CALCULOS!$C$27)+E168)","v":"-"},"-"]
[null,{"$f":"IF(OR(B168>=CALCULOS!$F$18,B168=\"-\"),\"-\",B168+1)","v":"-"},{"$f":"IF(B169=\"-\",\"-\",CALCULOS!$F$14+B169)","v":"-"},{"$f":"IF(B169=\"-\",\"-\",D168*(1+CALCULOS!$C$27))","v":"-"},{"$f":"IF(B169=\"-\",\"-\",IF(B169=1,CALCULOS!$C$47,IF(MOD(B168,12)=0,E167*(1+CALCULOS!$C$28),E168))*IF(MOD(B169,12)=0,2,1))","v":"-"},{"$f":"IF(B169=\"-\",\"-\",F168*(1+CALCULOS!$C$27)+E169)","v":"-"},"-"]
[null,{"$f":"IF(OR(B169>=CALCULOS!$F$18,B169=\"-\"),\"-\",B169+1)","v":"-"},{"$f":"IF(B170=\"-\",\"-\",CALCULOS!$F$14+B170)","v":"-"},{"$f":"IF(B170=\"-\",\"-\",D169*(1+CALCULOS!$C$27))","v":"-"},{"$f":"IF(B170=\"-\",\"-\",IF(B170=1,CALCULOS!$C$47,IF(MOD(B169,12)=0,E168*(1+CALCULOS!$C$28),E169))*IF(MOD(B170,12)=0,2,1))","v":"-"},{"$f":"IF(B170=\"-\",\"-\",F169*(1+CALCULOS!$C$27)+E170)","v":"-"},"-"]
[null,{"$f":"IF(OR(B170>=CALCULOS!$F$18,B170=\"-\"),\"-\",B170+1)","v":"-"},{"$f":"IF(B171=\"-\",\"-\",CALCULOS!$F$14+B171)","v":"-"},{"$f":"IF(B171=\"-\",\"-\",D170*(1+CALCULOS!$C$27))","v":"-"},{"$f":"IF(B171=\"-\",\"-\",IF(B171=1,CALCULOS!$C$47,IF(MOD(B170,12)=0,E169*(1+CALCULOS!$C$28),E170))*IF(MOD(B171,12)=0,2,1))","v":"-"},{"$f":"IF(B171=\"-\",\"-\",F170*(1+CALCULOS!$C$27)+E171)","v":"-"},"-"]
[null,{"$f":"IF(OR(B171>=CALCULOS!$F$18,B171=\"-\"),\"-\",B171+1)","v":"-"},{"$f":"IF(B172=\"-\",\"-\",CALCULOS!$F$14+B172)","v":"-"},{"$f":"IF(B172=\"-\",\"-\",D171*(1+CALCULOS!$C$27))","v":"-"},{"$f":"IF(B172=\"-\",\"-\",IF(B172=1,CALCULOS!$C$47,IF(MOD(B171,12)=0,E170*(1+CALCULOS!$C$28),E171))*IF(MOD(B172,12)=0,2,1))","v":"-"},{"$f":"IF(B172=\"-\",\"-\",F171*(1+CALCULOS!$C$27)+E172)","v":"-"},"-"]
[null,{"$f":"IF(OR(B172>=CALCULOS!$F$18,B172=\"-\"),\"-\",B172+1)","v":"-"},{"$f":"IF(B173=\"-\",\"-\",CALCULOS!$F$14+B173)","v":"-"},{"$f":"IF(B173=\"-\",\"-\",D172*(1+CALCULOS!$C$27))","v":"-"},{"$f":"IF(B173=\"-\",\"-\",IF(B173=1,CALCULOS!$C$47,IF(MOD(B172,12)=0,E171*(1+CALCULOS!$C$28),E172))*IF(MOD(B173,12)=0,2,1))","v":"-"},{"$f":"IF(B173=\"-\",\"-\",F172*(1+CALCULOS!$C$27)+E173)","v":"-"},"-"]
[null,{"$f":"IF(OR(B173>=CALCULOS!$F$18,B173=\"-\"),\"-\",B173+1)","v":"-"},{"$f":"IF(B174=\"-\",\"-\",CALCULOS!$F$14+B174)","v":"-"},{"$f":"IF(B174=\"-\",\"-\",D173*(1+CALCULOS!$C$27))","v":"-"},{"$f":"IF(B174=\"-\",\"-\",IF(B174=1,CALCULOS!$C$47,IF(MOD(B173,12)=0,E172*(1+CALCULOS!$C$28),E173))*IF(MOD(B174,12)=0,2,1))","v":"-"},{"$f":"IF(B174=\"-\",\"-\",F173*(1+CALCULOS!$C$27)+E174)","v":"-"},"-"]
[null,{"$f":"IF(OR(B174>=CALCULOS!$F$18,B174=\"-\"),\"-\",B174+1)","v":"-"},{"$f":"IF(B175=\"-\",\"-\",CALCULOS!$F$14+B175)","v":"-"},{"$f":"IF(B175=\"-\",\"-\",D174*(1+CALCULOS!$C$27))","v":"-"},{"$f":"IF(B175=\"-\",\"-\",IF(B175=1,CALCULOS!$C$47,IF(MOD(B174,12)=0,E173*(1+CALCULOS!$C$28),E174))*IF(MOD(B175,12)=0,2,1))","v":"-"},{"$f":"IF(B175=\"-\",\"-\",F174*(1+CALCULOS!$C$27)+E175)","v":"-"},"-"]
[null,{"$f":"IF(OR(B175>=CALCULOS!$F$18,B175=\"-\"),\"-\",B175+1)","v":"-"},{"$f":"IF(B176=\"-\",\"-\",CALCULOS!$F$14+B176)","v":"-"},{"$f":"IF(B176=\"-\",\"-\",D175*(1+CALCULOS!$C$27))","v":"-"},{"$f":"IF(B176=\"-\",\"-\",IF(B176=1,CALCULOS!$C$47,IF(MOD(B175,12)=0,E174*(1+CALCULOS!$C$28),E175))*IF(MOD(B176,12)=0,2,1))","v":"-"},{"$f":"IF(B176=\"-\",\"-\",F175*(1+CALCULOS!$C$27)+E176)","v":"-"},"-"]
[null,{"$f":"IF(OR(B176>=CALCULOS!$F$18,B176=\"-\"),\"-\",B176+1)","v":"-"},{"$f":"IF(B177=\"-\",\"-\",CALCULOS!$F$14+B177)","v":"-"},{"$f":"IF(B177=\"-\",\"-\",D176*(1+CALCULOS!$C$27))","v":"-"},{"$f":"IF(B177=\"-\",\"-\",IF(B177=1,CALCULOS!$C$47,IF(MOD(B176,12)=0,E175*(1+CALCULOS!$C$28),E176))*IF(MOD(B177,12)=0,2,1))","v":"-"},{"$f":"IF(B177=\"-\",\"-\",F176*(1+CALCULOS!$C$27)+E177)","v":"-"},"-"]
[null,{"$f":"IF(OR(B177>=CALCULOS!$F$18,B177=\"-\"),\"-\",B177+1)","v":"-"},{"$f":"IF(B178=\"-\",\"-\",CALCULOS!$F$14+B178)","v":"-"},{"$f":"IF(B178=\"-\",\"-\",D177*(1+CALCULOS!$C$27))","v":"-"},{"$f":"IF(B178=\"-\",\"-\",IF(B178=1,CALCULOS!$C$47,IF(MOD(B177,12)=0,E176*(1+CALCULOS!$C$28),E177))*IF(MOD(B178,12)=0,2,1))","v":"-"},{"$f":"IF(B178=\"-\",\"-\",F177*(1+CALCULOS!$C$27)+E178)","v":"-"},"-"]
[null,{"$f":"IF(OR(B178>=CALCULOS!$F$18,B178=\"-\"),\"-\",B178+1)","v":"-"},{"$f":"IF(B179=\"-\",\"-\",CALCULOS!$F$14+B179)","v":"-"},{"$f":"IF(B179=\"-\",\"-\",D178*(1+CALCULOS!$C$27))","v":"-"},{"$f":"IF(B179=\"-\",\"-\",IF(B179=1,CALCULOS!$C$47,IF(MOD(B178,12)=0,E177*(1+CALCULOS!$C$28),E178))*IF(MOD(B179,12)=0,2,1))","v":"-"},{"$f":"IF(B179=\"-\",\"-\",F178*(1+CALCULOS!$C$27)+E179)","v":"-"},"-"]
[null,{"$f":"IF(OR(B179>=CALCULOS!$F$18,B179=\"-\"),\"-\",B179+1)","v":"-"},{"$f":"IF(B180=\"-\",\"-\",CALCULOS!$F$14+B180)","v":"-"},{"$f":"IF(B180=\"-\",\"-\",D179*(1+CALCULOS!$C$27))","v":"-"},{"$f":"IF(B180=\"-\",\"-\",IF(B180=1,CALCULOS!$C$47,IF(MOD(B179,12)=0,E178*(1+CALCULOS!$C$28),E179))*IF(MOD(B180,12)=0,2,1))","v":"-"},{"$f":"IF(B180=\"-\",\"-\",F179*(1+CALCULOS!$C$27)+E180)","v":"-"},"-"]
[null,{"$f":"IF(OR(B180>=CALCULOS!$F$18,B180=\"-\"),\"-\",B180+1)","v":"-"},{"$f":"IF(B181=\"-\",\"-\",CALCULOS!$F$14+B181)","v":"-"},{"$f":"IF(B181=\"-\",\"-\",D180*(1+CALCULOS!$C$27))","v":"-"},{"$f":"IF(B181=\"-\",\"-\",IF(B181=1,CALCULOS!$C$47,IF(MOD(B180,12)=0,E179*(1+CALCULOS!$C$28),E180))*IF(MOD(B181,12)=0,2,1))","v":"-"},{"$f":"IF(B181=\"-\",\"-\",F180*(1+CALCULOS!$C$27)+E181)","v":"-"},"-"]
[null,{"$f":"IF(OR(B181>=CALCULOS!$F$18,B181=\"-\"),\"-\",B181+1)","v":"-"},{"$f":"IF(B182=\"-\",\"-\",CALCULOS!$F$14+B182)","v":"-"},{"$f":"IF(B182=\"-\",\"-\",D181*(1+CALCULOS!$C$27))","v":"-"},{"$f":"IF(B182=\"-\",\"-\",IF(B182=1,CALCULOS!$C$47,IF(MOD(B181,12)=0,E180*(1+CALCULOS!$C$28),E181))*IF(MOD(B182,12)=0,2,1))","v":"-"},{"$f":"IF(B182=\"-\",\"-\",F181*(1+CALCULOS!$C$27)+E182)","v":"-"},"-"]
[null,{"$f":"IF(OR(B182>=CALCULOS!$F$18,B182=\"-\"),\"-\",B182+1)","v":"-"},{"$f":"IF(B183=\"-\",\"-\",CALCULOS!$F$14+B183)","v":"-"},{"$f":"IF(B183=\"-\",\"-\",D182*(1+CALCULOS!$C$27))","v":"-"},{"$f":"IF(B183=\"-\",\"-\",IF(B183=1,CALCULOS!$C$47,IF(MOD(B182,12)=0,E181*(1+CALCULOS!$C$28),E182))*IF(MOD(B183,12)=0,2,1))","v":"-"},{"$f":"IF(B183=\"-\",\"-\",F182*(1+CALCULOS!$C$27)+E183)","v":"-"},"-"]
[null,{"$f":"IF(OR(B183>=CALCULOS!$F$18,B183=\"-\"),\"-\",B183+1)","v":"-"},{"$f":"IF(B184=\"-\",\"-\",CALCULOS!$F$14+B184)","v":"-"},{"$f":"IF(B184=\"-\",\"-\",D183*(1+CALCULOS!$C$27))","v":"-"},{"$f":"IF(B184=\"-\",\"-\",IF(B184=1,CALCULOS!$C$47,IF(MOD(B183,12)=0,E182*(1+CALCULOS!$C$28),E183))*IF(MOD(B184,12)=0,2,1))","v":"-"},{"$f":"IF(B184=\"-\",\"-\",F183*(1+CALCULOS!$C$27)+E184)","v":"-"},"-"]
[null,{"$f":"IF(OR(B184>=CALCULOS!$F$18,B184=\"-\"),\"-\",B184+1)","v":"-"},{"$f":"IF(B185=\"-\",\"-\",CALCULOS!$F$14+B185)","v":"-"},{"$f":"IF(B185=\"-\",\"-\",D184*(1+CALCULOS!$C$27))","v":"-"},{"$f":"IF(B185=\"-\",\"-\",IF(B185=1,CALCULOS!$C$47,IF(MOD(B184,12)=0,E183*(1+CALCULOS!$C$28),E184))*IF(MOD(B185,12)=0,2,1))","v":"-"},{"$f":"IF(B185=\"-\",\"-\",F184*(1+CALCULOS!$C$27)+E185)","v":"-"},"-"]
[null,{"$f":"IF(OR(B185>=CALCULOS!$F$18,B185=\"-\"),\"-\",B185+1)","v":"-"},{"$f":"IF(B186=\"-\",\"-\",CALCULOS!$F$14+B186)","v":"-"},{"$f":"IF(B186=\"-\",\"-\",D185*(1+CALCULOS!$C$27))","v":"-"},{"$f":"IF(B186=\"-\",\"-\",IF(B186=1,CALCULOS!$C$47,IF(MOD(B185,12)=0,E184*(1+CALCULOS!$C$28),E185))*IF(MOD(B186,12)=0,2,1))","v":"-"},{"$f":"IF(B186=\"-\",\"-\",F185*(1+CALCULOS!$C$27)+E186)","v":"-"},"-"]
[null,{"$f":"IF(OR(B186>=CALCULOS!$F$18,B186=\"-\"),\"-\",B186+1)","v":"-"},{"$f":"IF(B187=\"-\",\"-\",CALCULOS!$F$14+B187)","v":"-"},{"$f":"IF(B187=\"-\",\"-\",D186*(1+CALCULOS!$C$27))","v":"-"},{"$f":"IF(B187=\"-\",\"-\",IF(B187=1,CALCULOS!$C$47,IF(MOD(B186,12)=0,E185*(1+CALCULOS!$C$28),E186))*IF(MOD(B187,12)=0,2,1))","v":"-"},{"$f":"IF(B187=\"-\",\"-\",F186*(1+CALCULOS!$C$27)+E187)","v":"-"},"-"]
[null,{"$f":"IF(OR(B187>=CALCULOS!$F$18,B187=\"-\"),\"-\",B187+1)","v":"-"},{"$f":"IF(B188=\"-\",\"-\",CALCULOS!$F$14+B188)","v":"-"},{"$f":"IF(B188=\"-\",\"-\",D187*(1+CALCULOS!$C$27))","v":"-"},{"$f":"IF(B188=\"-\",\"-\",IF(B188=1,CALCULOS!$C$47,IF(MOD(B187,12)=0,E186*(1+CALCULOS!$C$28),E187))*IF(MOD(B188,12)=0,2,1))","v":"-"},{"$f":"IF(B188=\"-\",\"-\",F187*(1+CALCULOS!$C$27)+E188)","v":"-"},"-"]
[null,{"$f":"IF(OR(B188>=CALCULOS!$F$18,B188=\"-\"),\"-\",B188+1)","v":"-"},{"$f":"IF(B189=\"-\",\"-\",CALCULOS!$F$14+B189)","v":"-"},{"$f":"IF(B189=\"-\",\"-\",D188*(1+CALCULOS!$C$27))","v":"-"},{"$f":"IF(B189=\"-\",\"-\",IF(B189=1,CALCULOS!$C$47,IF(MOD(B188,12)=0,E187*(1+CALCULOS!$C$28),E188))*IF(MOD(B189,12)=0,2,1))","v":"-"},{"$f":"IF(B189=\"-\",\"-\",F188*(1+CALCULOS!$C$27)+E189)","v":"-"},"-"]
[null,{"$f":"IF(OR(B189>=CALCULOS!$F$18,B189=\"-\"),\"-\",B189+1)","v":"-"},{"$f":"IF(B190=\"-\",\"-\",CALCULOS!$F$14+B190)","v":"-"},{"$f":"IF(B190=\"-\",\"-\",D189*(1+CALCULOS!$C$27))","v":"-"},{"$f":"IF(B190=\"-\",\"-\",IF(B190=1,CALCULOS!$C$47,IF(MOD(B189,12)=0,E188*(1+CALCULOS!$C$28),E189))*IF(MOD(B190,12)=0,2,1))","v":"-"},{"$f":"IF(B190=\"-\",\"-\",F189*(1+CALCULOS!$C$27)+E190)","v":"-"},"-"]
[null,{"$f":"IF(OR(B190>=CALCULOS!$F$18,B190=\"-\"),\"-\",B190+1)","v":"-"},{"$f":"IF(B191=\"-\",\"-\",CALCULOS!$F$14+B191)","v":"-"},{"$f":"IF(B191=\"-\",\"-\",D190*(1+CALCULOS!$C$27))","v":"-"},{"$f":"IF(B191=\"-\",\"-\",IF(B191=1,CALCULOS!$C$47,IF(MOD(B190,12)=0,E189*(1+CALCULOS!$C$28),E190))*IF(MOD(B191,12)=0,2,1))","v":"-"},{"$f":"IF(B191=\"-\",\"-\",F190*(1+CALCULOS!$C$27)+E191)","v":"-"},"-"]
[null,{"$f":"IF(OR(B191>=CALCULOS!$F$18,B191=\"-\"),\"-\",B191+1)","v":"-"},{"$f":"IF(B192=\"-\",\"-\",CALCULOS!$F$14+B192)","v":"-"},{"$f":"IF(B192=\"-\",\"-\",D191*(1+CALCULOS!$C$27))","v":"-"},{"$f":"IF(B192=\"-\",\"-\",IF(B192=1,CALCULOS!$C$47,IF(MOD(B191,12)=0,E190*(1+CALCULOS!$C$28),E191))*IF(MOD(B192,12)=0,2,1))","v":"-"},{"$f":"IF(B192=\"-\",\"-\",F191*(1+CALCULOS!$C$27)+E192)","v":"-"},"-"]
[null,{"$f":"IF(OR(B192>=CALCULOS!$F$18,B192=\"-\"),\"-\",B192+1)","v":"-"},{"$f":"IF(B193=\"-\",\"-\",CALCULOS!$F$14+B193)","v":"-"},{"$f":"IF(B193=\"-\",\"-\",D192*(1+CALCULOS!$C$27))","v":"-"},{"$f":"IF(B193=\"-\",\"-\",IF(B193=1,CALCULOS!$C$47,IF(MOD(B192,12)=0,E191*(1+CALCULOS!$C$28),E192))*IF(MOD(B193,12)=0,2,1))","v":"-"},{"$f":"IF(B193=\"-\",\"-\",F192*(1+CALCULOS!$C$27)+E193)","v":"-"},"-"]
[null,{"$f":"IF(OR(B193>=CALCULOS!$F$18,B193=\"-\"),\"-\",B193+1)","v":"-"},{"$f":"IF(B194=\"-\",\"-\",CALCULOS!$F$14+B194)","v":"-"},{"$f":"IF(B194=\"-\",\"-\",D193*(1+CALCULOS!$C$27))","v":"-"},{"$f":"IF(B194=\"-\",\"-\",IF(B194=1,CALCULOS!$C$47,IF(MOD(B193,12)=0,E192*(1+CALCULOS!$C$28),E193))*IF(MOD(B194,12)=0,2,1))","v":"-"},{"$f":"IF(B194=\"-\",\"-\",F193*(1+CALCULOS!$C$27)+E194)","v":"-"},"-"]
[null,{"$f":"IF(OR(B194>=CALCULOS!$F$18,B194=\"-\"),\"-\",B194+1)","v":"-"},{"$f":"IF(B195=\"-\",\"-\",CALCULOS!$F$14+B195)","v":"-"},{"$f":"IF(B195=\"-\",\"-\",D194*(1+CALCULOS!$C$27))","v":"-"},{"$f":"IF(B195=\"-\",\"-\",IF(B195=1,CALCULOS!$C$47,IF(MOD(B194,12)=0,E193*(1+CALCULOS!$C$28),E194))*IF(MOD(B195,12)=0,2,1))","v":"-"},{"$f":"IF(B195=\"-\",\"-\",F194*(1+CALCULOS!$C$27)+E195)","v":"-"},"-"]
[null,{"$f":"IF(OR(B195>=CALCULOS!$F$18,B195=\"-\"),\"-\",B195+1)","v":"-"},{"$f":"IF(B196=\"-\",\"-\",CALCULOS!$F$14+B196)","v":"-"},{"$f":"IF(B196=\"-\",\"-\",D195*(1+CALCULOS!$C$27))","v":"-"},{"$f":"IF(B196=\"-\",\"-\",IF(B196=1,CALCULOS!$C$47,IF(MOD(B195,12)=0,E194*(1+CALCULOS!$C$28),E195))*IF(MOD(B196,12)=0,2,1))","v":"-"},{"$f":"IF(B196=\"-\",\"-\",F195*(1+CALCULOS!$C$27)+E196)","v":"-"},"-"]
[null,{"$f":"IF(OR(B196>=CALCULOS!$F$18,B196=\"-\"),\"-\",B196+1)","v":"-"},{"$f":"IF(B197=\"-\",\"-\",CALCULOS!$F$14+B197)","v":"-"},{"$f":"IF(B197=\"-\",\"-\",D196*(1+CALCULOS!$C$27))","v":"-"},{"$f":"IF(B197=\"-\",\"-\",IF(B197=1,CALCULOS!$C$47,IF(MOD(B196,12)=0,E195*(1+CALCULOS!$C$28),E196))*IF(MOD(B197,12)=0,2,1))","v":"-"},{"$f":"IF(B197=\"-\",\"-\",F196*(1+CALCULOS!$C$27)+E197)","v":"-"},"-"]
[null,{"$f":"IF(OR(B197>=CALCULOS!$F$18,B197=\"-\"),\"-\",B197+1)","v":"-"},{"$f":"IF(B198=\"-\",\"-\",CALCULOS!$F$14+B198)","v":"-"},{"$f":"IF(B198=\"-\",\"-\",D197*(1+CALCULOS!$C$27))","v":"-"},{"$f":"IF(B198=\"-\",\"-\",IF(B198=1,CALCULOS!$C$47,IF(MOD(B197,12)=0,E196*(1+CALCULOS!$C$28),E197))*IF(MOD(B198,12)=0,2,1))","v":"-"},{"$f":"IF(B198=\"-\",\"-\",F197*(1+CALCULOS!$C$27)+E198)","v":"-"},"-"]
[null,{"$f":"IF(OR(B198>=CALCULOS!$F$18,B198=\"-\"),\"-\",B198+1)","v":"-"},{"$f":"IF(B199=\"-\",\"-\",CALCULOS!$F$14+B199)","v":"-"},{"$f":"IF(B199=\"-\",\"-\",D198*(1+CALCULOS!$C$27))","v":"-"},{"$f":"IF(B199=\"-\",\"-\",IF(B199=1,CALCULOS!$C$47,IF(MOD(B198,12)=0,E197*(1+CALCULOS!$C$28),E198))*IF(MOD(B199,12)=0,2,1))","v":"-"},{"$f":"IF(B199=\"-\",\"-\",F198*(1+CALCULOS!$C$27)+E199)","v":"-"},"-"]
[null,{"$f":"IF(OR(B199>=CALCULOS!$F$18,B199=\"-\"),\"-\",B199+1)","v":"-"},{"$f":"IF(B200=\"-\",\"-\",CALCULOS!$F$14+B200)","v":"-"},{"$f":"IF(B200=\"-\",\"-\",D199*(1+CALCULOS!$C$27))","v":"-"},{"$f":"IF(B200=\"-\",\"-\",IF(B200=1,CALCULOS!$C$47,IF(MOD(B199,12)=0,E198*(1+CALCULOS!$C$28),E199))*IF(MOD(B200,12)=0,2,1))","v":"-"},{"$f":"IF(B200=\"-\",\"-\",F199*(1+CALCULOS!$C$27)+E200)","v":"-"},"-"]
[null,{"$f":"IF(OR(B200>=CALCULOS!$F$18,B200=\"-\"),\"-\",B200+1)","v":"-"},{"$f":"IF(B201=\"-\",\"-\",CALCULOS!$F$14+B201)","v":"-"},{"$f":"IF(B201=\"-\",\"-\",D200*(1+CALCULOS!$C$27))","v":"-"},{"$f":"IF(B201=\"-\",\"-\",IF(B201=1,CALCULOS!$C$47,IF(MOD(B200,12)=0,E199*(1+CALCULOS!$C$28),E200))*IF(MOD(B201,12)=0,2,1))","v":"-"},{"$f":"IF(B201=\"-\",\"-\",F200*(1+CALCULOS!$C$27)+E201)","v":"-"},"-"]
[null,{"$f":"IF(OR(B201>=CALCULOS!$F$18,B201=\"-\"),\"-\",B201+1)","v":"-"},{"$f":"IF(B202=\"-\",\"-\",CALCULOS!$F$14+B202)","v":"-"},{"$f":"IF(B202=\"-\",\"-\",D201*(1+CALCULOS!$C$27))","v":"-"},{"$f":"IF(B202=\"-\",\"-\",IF(B202=1,CALCULOS!$C$47,IF(MOD(B201,12)=0,E200*(1+CALCULOS!$C$28),E201))*IF(MOD(B202,12)=0,2,1))","v":"-"},{"$f":"IF(B202=\"-\",\"-\",F201*(1+CALCULOS!$C$27)+E202)","v":"-"},"-"]
[null,{"$f":"IF(OR(B202>=CALCULOS!$F$18,B202=\"-\"),\"-\",B202+1)","v":"-"},{"$f":"IF(B203=\"-\",\"-\",CALCULOS!$F$14+B203)","v":"-"},{"$f":"IF(B203=\"-\",\"-\",D202*(1+CALCULOS!$C$27))","v":"-"},{"$f":"IF(B203=\"-\",\"-\",IF(B203=1,CALCULOS!$C$47,IF(MOD(B202,12)=0,E201*(1+CALCULOS!$C$28),E202))*IF(MOD(B203,12)=0,2,1))","v":"-"},{"$f":"IF(B203=\"-\",\"-\",F202*(1+CALCULOS!$C$27)+E203)","v":"-"},"-"]
[null,{"$f":"IF(OR(B203>=CALCULOS!$F$18,B203=\"-\"),\"-\",B203+1)","v":"-"},{"$f":"IF(B204=\"-\",\"-\",CALCULOS!$F$14+B204)","v":"-"},{"$f":"IF(B204=\"-\",\"-\",D203*(1+CALCULOS!$C$27))","v":"-"},{"$f":"IF(B204=\"-\",\"-\",IF(B204=1,CALCULOS!$C$47,IF(MOD(B203,12)=0,E202*(1+CALCULOS!$C$28),E203))*IF(MOD(B204,12)=0,2,1))","v":"-"},{"$f":"IF(B204=\"-\",\"-\",F203*(1+CALCULOS!$C$27)+E204)","v":"-"},"-"]
[null,{"$f":"IF(OR(B204>=CALCULOS!$F$18,B204=\"-\"),\"-\",B204+1)","v":"-"},{"$f":"IF(B205=\"-\",\"-\",CALCULOS!$F$14+B205)","v":"-"},{"$f":"IF(B205=\"-\",\"-\",D204*(1+CALCULOS!$C$27))","v":"-"},{"$f":"IF(B205=\"-\",\"-\",IF(B205=1,CALCULOS!$C$47,IF(MOD(B204,12)=0,E203*(1+CALCULOS!$C$28),E204))*IF(MOD(B205,12)=0,2,1))","v":"-"},{"$f":"IF(B205=\"-\",\"-\",F204*(1+CALCULOS!$C$27)+E205)","v":"-"},"-"]
[null,{"$f":"IF(OR(B205>=CALCULOS!$F$18,B205=\"-\"),\"-\",B205+1)","v":"-"},{"$f":"IF(B206=\"-\",\"-\",CALCULOS!$F$14+B206)","v":"-"},{"$f":"IF(B206=\"-\",\"-\",D205*(1+CALCULOS!$C$27))","v":"-"},{"$f":"IF(B206=\"-\",\"-\",IF(B206=1,CALCULOS!$C$47,IF(MOD(B205,12)=0,E204*(1+CALCULOS!$C$28),E205))*IF(MOD(B206,12)=0,2,1))","v":"-"},{"$f":"IF(B206=\"-\",\"-\",F205*(1+CALCULOS!$C$27)+E206)","v":"-"},"-"]
[null,{"$f":"IF(OR(B206>=CALCULOS!$F$18,B206=\"-\"),\"-\",B206+1)","v":"-"},{"$f":"IF(B207=\"-\",\"-\",CALCULOS!$F$14+B207)","v":"-"},{"$f":"IF(B207=\"-\",\"-\",D206*(1+CALCULOS!$C$27))","v":"-"},{"$f":"IF(B207=\"-\",\"-\",IF(B207=1,CALCULOS!$C$47,IF(MOD(B206,12)=0,E205*(1+CALCULOS!$C$28),E206))*IF(MOD(B207,12)=0,2,1))","v":"-"},{"$f":"IF(B207=\"-\",\"-\",F206*(1+CALCULOS!$C$27)+E207)","v":"-"},"-"]
[null,{"$f":"IF(OR(B207>=CALCULOS!$F$18,B207=\"-\"),\"-\",B207+1)","v":"-"},{"$f":"IF(B208=\"-\",\"-\",CALCULOS!$F$14+B208)","v":"-"},{"$f":"IF(B208=\"-\",\"-\",D207*(1+CALCULOS!$C$27))","v":"-"},{"$f":"IF(B208=\"-\",\"-\",IF(B208=1,CALCULOS!$C$47,IF(MOD(B207,12)=0,E206*(1+CALCULOS!$C$28),E207))*IF(MOD(B208,12)=0,2,1))","v":"-"},{"$f":"IF(B208=\"-\",\"-\",F207*(1+CALCULOS!$C$27)+E208)","v":"-"},"-"]
[null,{"$f":"IF(OR(B208>=CALCULOS!$F$18,B208=\"-\"),\"-\",B208+1)","v":"-"},{"$f":"IF(B209=\"-\",\"-\",CALCULOS!$F$14+B209)","v":"-"},{"$f":"IF(B209=\"-\",\"-\",D208*(1+CALCULOS!$C$27))","v":"-"},{"$f":"IF(B209=\"-\",\"-\",IF(B209=1,CALCULOS!$C$47,IF(MOD(B208,12)=0,E207*(1+CALCULOS!$C$28),E208))*IF(MOD(B209,12)=0,2,1))","v":"-"},{"$f":"IF(B209=\"-\",\"-\",F208*(1+CALCULOS!$C$27)+E209)","v":"-"},"-"]
[null,{"$f":"IF(OR(B209>=CALCULOS!$F$18,B209=\"-\"),\"-\",B209+1)","v":"-"},{"$f":"IF(B210=\"-\",\"-\",CALCULOS!$F$14+B210)","v":"-"},{"$f":"IF(B210=\"-\",\"-\",D209*(1+CALCULOS!$C$27))","v":"-"},{"$f":"IF(B210=\"-\",\"-\",IF(B210=1,CALCULOS!$C$47,IF(MOD(B209,12)=0,E208*(1+CALCULOS!$C$28),E209))*IF(MOD(B210,12)=0,2,1))","v":"-"},{"$f":"IF(B210=\"-\",\"-\",F209*(1+CALCULOS!$C$27)+E210)","v":"-"},"-"]
[null,{"$f":"IF(OR(B210>=CALCULOS!$F$18,B210=\"-\"),\"-\",B210+1)","v":"-"},{"$f":"IF(B211=\"-\",\"-\",CALCULOS!$F$14+B211)","v":"-"},{"$f":"IF(B211=\"-\",\"-\",D210*(1+CALCULOS!$C$27))","v":"-"},{"$f":"IF(B211=\"-\",\"-\",IF(B211=1,CALCULOS!$C$47,IF(MOD(B210,12)=0,E209*(1+CALCULOS!$C$28),E210))*IF(MOD(B211,12)=0,2,1))","v":"-"},{"$f":"IF(B211=\"-\",\"-\",F210*(1+CALCULOS!$C$27)+E211)","v":"-"},"-"]
[null,{"$f":"IF(OR(B211>=CALCULOS!$F$18,B211=\"-\"),\"-\",B211+1)","v":"-"},{"$f":"IF(B212=\"-\",\"-\",CALCULOS!$F$14+B212)","v":"-"},{"$f":"IF(B212=\"-\",\"-\",D211*(1+CALCULOS!$C$27))","v":"-"},{"$f":"IF(B212=\"-\",\"-\",IF(B212=1,CALCULOS!$C$47,IF(MOD(B211,12)=0,E210*(1+CALCULOS!$C$28),E211))*IF(MOD(B212,12)=0,2,1))","v":"-"},{"$f":"IF(B212=\"-\",\"-\",F211*(1+CALCULOS!$C$27)+E212)","v":"-"},"-"]
[null,{"$f":"IF(OR(B212>=CALCULOS!$F$18,B212=\"-\"),\"-\",B212+1)","v":"-"},{"$f":"IF(B213=\"-\",\"-\",CALCULOS!$F$14+B213)","v":"-"},{"$f":"IF(B213=\"-\",\"-\",D212*(1+CALCULOS!$C$27))","v":"-"},{"$f":"IF(B213=\"-\",\"-\",IF(B213=1,CALCULOS!$C$47,IF(MOD(B212,12)=0,E211*(1+CALCULOS!$C$28),E212))*IF(MOD(B213,12)=0,2,1))","v":"-"},{"$f":"IF(B213=\"-\",\"-\",F212*(1+CALCULOS!$C$27)+E213)","v":"-"},"-"]
[null,{"$f":"IF(OR(B213>=CALCULOS!$F$18,B213=\"-\"),\"-\",B213+1)","v":"-"},{"$f":"IF(B214=\"-\",\"-\",CALCULOS!$F$14+B214)","v":"-"},{"$f":"IF(B214=\"-\",\"-\",D213*(1+CALCULOS!$C$27))","v":"-"},{"$f":"IF(B214=\"-\",\"-\",IF(B214=1,CALCULOS!$C$47,IF(MOD(B213,12)=0,E212*(1+CALCULOS!$C$28),E213))*IF(MOD(B214,12)=0,2,1))","v":"-"},{"$f":"IF(B214=\"-\",\"-\",F213*(1+CALCULOS!$C$27)+E214)","v":"-"},"-"]
[null,{"$f":"IF(OR(B214>=CALCULOS!$F$18,B214=\"-\"),\"-\",B214+1)","v":"-"},{"$f":"IF(B215=\"-\",\"-\",CALCULOS!$F$14+B215)","v":"-"},{"$f":"IF(B215=\"-\",\"-\",D214*(1+CALCULOS!$C$27))","v":"-"},{"$f":"IF(B215=\"-\",\"-\",IF(B215=1,CALCULOS!$C$47,IF(MOD(B214,12)=0,E213*(1+CALCULOS!$C$28),E214))*IF(MOD(B215,12)=0,2,1))","v":"-"},{"$f":"IF(B215=\"-\",\"-\",F214*(1+CALCULOS!$C$27)+E215)","v":"-"},"-"]
[null,{"$f":"IF(OR(B215>=CALCULOS!$F$18,B215=\"-\"),\"-\",B215+1)","v":"-"},{"$f":"IF(B216=\"-\",\"-\",CALCULOS!$F$14+B216)","v":"-"},{"$f":"IF(B216=\"-\",\"-\",D215*(1+CALCULOS!$C$27))","v":"-"},{"$f":"IF(B216=\"-\",\"-\",IF(B216=1,CALCULOS!$C$47,IF(MOD(B215,12)=0,E214*(1+CALCULOS!$C$28),E215))*IF(MOD(B216,12)=0,2,1))","v":"-"},{"$f":"IF(B216=\"-\",\"-\",F215*(1+CALCULOS!$C$27)+E216)","v":"-"},"-"]
[null,{"$f":"IF(OR(B216>=CALCULOS!$F$18,B216=\"-\"),\"-\",B216+1)","v":"-"},{"$f":"IF(B217=\"-\",\"-\",CALCULOS!$F$14+B217)","v":"-"},{"$f":"IF(B217=\"-\",\"-\",D216*(1+CALCULOS!$C$27))","v":"-"},{"$f":"IF(B217=\"-\",\"-\",IF(B217=1,CALCULOS!$C$47,IF(MOD(B216,12)=0,E215*(1+CALCULOS!$C$28),E216))*IF(MOD(B217,12)=0,2,1))","v":"-"},{"$f":"IF(B217=\"-\",\"-\",F216*(1+CALCULOS!$C$27)+E217)","v":"-"},{"$f":"IF(B217=\"-\",\"-\",SUM(D217,F217))","v":"-"}]
[null,{"$f":"IF(OR(B217>=CALCULOS!$F$18,B217=\"-\"),\"-\",B217+1)","v":"-"},{"$f":"IF(B218=\"-\",\"-\",CALCULOS!$F$14+B218)","v":"-"},{"$f":"IF(B218=\"-\",\"-\",D217*(1+CALCULOS!$C$27))","v":"-"},{"$f":"IF(B218=\"-\",\"-\",IF(B218=1,CALCULOS!$C$47,IF(MOD(B217,12)=0,E216*(1+CALCULOS!$C$28),E217))*IF(MOD(B218,12)=0,2,1))","v":"-"},{"$f":"IF(B218=\"-\",\"-\",F217*(1+CALCULOS!$C$27)+E218)","v":"-"},"-"]
[null,{"$f":"IF(OR(B218>=CALCULOS!$F$18,B218=\"-\"),\"-\",B218+1)","v":"-"},{"$f":"IF(B219=\"-\",\"-\",CALCULOS!$F$14+B219)","v":"-"},{"$f":"IF(B219=\"-\",\"-\",D218*(1+CALCULOS!$C$27))","v":"-"},{"$f":"IF(B219=\"-\",\"-\",IF(B219=1,CALCULOS!$C$47,IF(MOD(B218,12)=0,E217*(1+CALCULOS!$C$28),E218))*IF(MOD(B219,12)=0,2,1))","v":"-"},{"$f":"IF(B219=\"-\",\"-\",F218*(1+CALCULOS!$C$27)+E219)","v":"-"},"-"]
[null,{"$f":"IF(OR(B219>=CALCULOS!$F$18,B219=\"-\"),\"-\",B219+1)","v":"-"},{"$f":"IF(B220=\"-\",\"-\",CALCULOS!$F$14+B220)","v":"-"},{"$f":"IF(B220=\"-\",\"-\",D219*(1+CALCULOS!$C$27))","v":"-"},{"$f":"IF(B220=\"-\",\"-\",IF(B220=1,CALCULOS!$C$47,IF(MOD(B219,12)=0,E218*(1+CALCULOS!$C$28),E219))*IF(MOD(B220,12)=0,2,1))","v":"-"},{"$f":"IF(B220=\"-\",\"-\",F219*(1+CALCULOS!$C$27)+E220)","v":"-"},"-"]
[null,{"$f":"IF(OR(B220>=CALCULOS!$F$18,B220=\"-\"),\"-\",B220+1)","v":"-"},{"$f":"IF(B221=\"-\",\"-\",CALCULOS!$F$14+B221)","v":"-"},{"$f":"IF(B221=\"-\",\"-\",D220*(1+CALCULOS!$C$27))","v":"-"},{"$f":"IF(B221=\"-\",\"-\",IF(B221=1,CALCULOS!$C$47,IF(MOD(B220,12)=0,E219*(1+CALCULOS!$C$28),E220))*IF(MOD(B221,12)=0,2,1))","v":"-"},{"$f":"IF(B221=\"-\",\"-\",F220*(1+CALCULOS!$C$27)+E221)","v":"-"},"-"]
[null,{"$f":"IF(OR(B221>=CALCULOS!$F$18,B221=\"-\"),\"-\",B221+1)","v":"-"},{"$f":"IF(B222=\"-\",\"-\",CALCULOS!$F$14+B222)","v":"-"},{"$f":"IF(B222=\"-\",\"-\",D221*(1+CALCULOS!$C$27))","v":"-"},{"$f":"IF(B222=\"-\",\"-\",IF(B222=1,CALCULOS!$C$47,IF(MOD(B221,12)=0,E220*(1+CALCULOS!$C$28),E221))*IF(MOD(B222,12)=0,2,1))","v":"-"},{"$f":"IF(B222=\"-\",\"-\",F221*(1+CALCULOS!$C$27)+E222)","v":"-"},"-"]
[null,{"$f":"IF(OR(B222>=CALCULOS!$F$18,B222=\"-\"),\"-\",B222+1)","v":"-"},{"$f":"IF(B223=\"-\",\"-\",CALCULOS!$F$14+B223)","v":"-"},{"$f":"IF(B223=\"-\",\"-\",D222*(1+CALCULOS!$C$27))","v":"-"},{"$f":"IF(B223=\"-\",\"-\",IF(B223=1,CALCULOS!$C$47,IF(MOD(B222,12)=0,E221*(1+CALCULOS!$C$28),E222))*IF(MOD(B223,12)=0,2,1))","v":"-"},{"$f":"IF(B223=\"-\",\"-\",F222*(1+CALCULOS!$C$27)+E223)","v":"-"},"-"]
[null,{"$f":"IF(OR(B223>=CALCULOS!$F$18,B223=\"-\"),\"-\",B223+1)","v":"-"},{"$f":"IF(B224=\"-\",\"-\",CALCULOS!$F$14+B224)","v":"-"},{"$f":"IF(B224=\"-\",\"-\",D223*(1+CALCULOS!$C$27))","v":"-"},{"$f":"IF(B224=\"-\",\"-\",IF(B224=1,CALCULOS!$C$47,IF(MOD(B223,12)=0,E222*(1+CALCULOS!$C$28),E223))*IF(MOD(B224,12)=0,2,1))","v":"-"},{"$f":"IF(B224=\"-\",\"-\",F223*(1+CALCULOS!$C$27)+E224)","v":"-"},"-"]
[null,{"$f":"IF(OR(B224>=CALCULOS!$F$18,B224=\"-\"),\"-\",B224+1)","v":"-"},{"$f":"IF(B225=\"-\",\"-\",CALCULOS!$F$14+B225)","v":"-"},{"$f":"IF(B225=\"-\",\"-\",D224*(1+CALCULOS!$C$27))","v":"-"},{"$f":"IF(B225=\"-\",\"-\",IF(B225=1,CALCULOS!$C$47,IF(MOD(B224,12)=0,E223*(1+CALCULOS!$C$28),E224))*IF(MOD(B225,12)=0,2,1))","v":"-"},{"$f":"IF(B225=\"-\",\"-\",F224*(1+CALCULOS!$C$27)+E225)","v":"-"},"-"]
[null,{"$f":"IF(OR(B225>=CALCULOS!$F$18,B225=\"-\"),\"-\",B225+1)","v":"-"},{"$f":"IF(B226=\"-\",\"-\",CALCULOS!$F$14+B226)","v":"-"},{"$f":"IF(B226=\"-\",\"-\",D225*(1+CALCULOS!$C$27))","v":"-"},{"$f":"IF(B226=\"-\",\"-\",IF(B226=1,CALCULOS!$C$47,IF(MOD(B225,12)=0,E224*(1+CALCULOS!$C$28),E225))*IF(MOD(B226,12)=0,2,1))","v":"-"},{"$f":"IF(B226=\"-\",\"-\",F225*(1+CALCULOS!$C$27)+E226)","v":"-"},"-"]
[null,{"$f":"IF(OR(B226>=CALCULOS!$F$18,B226=\"-\"),\"-\",B226+1)","v":"-"},{"$f":"IF(B227=\"-\",\"-\",CALCULOS!$F$14+B227)","v":"-"},{"$f":"IF(B227=\"-\",\"-\",D226*(1+CALCULOS!$C$27))","v":"-"},{"$f":"IF(B227=\"-\",\"-\",IF(B227=1,CALCULOS!$C$47,IF(MOD(B226,12)=0,E225*(1+CALCULOS!$C$28),E226))*IF(MOD(B227,12)=0,2,1))","v":"-"},{"$f":"IF(B227=\"-\",\"-\",F226*(1+CALCULOS!$C$27)+E227)","v":"-"},"-"]
[null,{"$f":"IF(OR(B227>=CALCULOS!$F$18,B227=\"-\"),\"-\",B227+1)","v":"-"},{"$f":"IF(B228=\"-\",\"-\",CALCULOS!$F$14+B228)","v":"-"},{"$f":"IF(B228=\"-\",\"-\",D227*(1+CALCULOS!$C$27))","v":"-"},{"$f":"IF(B228=\"-\",\"-\",IF(B228=1,CALCULOS!$C$47,IF(MOD(B227,12)=0,E226*(1+CALCULOS!$C$28),E227))*IF(MOD(B228,12)=0,2,1))","v":"-"},{"$f":"IF(B228=\"-\",\"-\",F227*(1+CALCULOS!$C$27)+E228)","v":"-"},"-"]
[null,{"$f":"IF(OR(B228>=CALCULOS!$F$18,B228=\"-\"),\"-\",B228+1)","v":"-"},{"$f":"IF(B229=\"-\",\"-\",CALCULOS!$F$14+B229)","v":"-"},{"$f":"IF(B229=\"-\",\"-\",D228*(1+CALCULOS!$C$27))","v":"-"},{"$f":"IF(B229=\"-\",\"-\",IF(B229=1,CALCULOS!$C$47,IF(MOD(B228,12)=0,E227*(1+CALCULOS!$C$28),E228))*IF(MOD(B229,12)=0,2,1))","v":"-"},{"$f":"IF(B229=\"-\",\"-\",F228*(1+CALCULOS!$C$27)+E229)","v":"-"},"-"]
[null,{"$f":"IF(OR(B229>=CALCULOS!$F$18,B229=\"-\"),\"-\",B229+1)","v":"-"},{"$f":"IF(B230=\"-\",\"-\",CALCULOS!$F$14+B230)","v":"-"},{"$f":"IF(B230=\"-\",\"-\",D229*(1+CALCULOS!$C$27))","v":"-"},{"$f":"IF(B230=\"-\",\"-\",IF(B230=1,CALCULOS!$C$47,IF(MOD(B229,12)=0,E228*(1+CALCULOS!$C$28),E229))*IF(MOD(B230,12)=0,2,1))","v":"-"},{"$f":"IF(B230=\"-\",\"-\",F229*(1+CALCULOS!$C$27)+E230)","v":"-"},"-"]
[null,{"$f":"IF(OR(B230>=CALCULOS!$F$18,B230=\"-\"),\"-\",B230+1)","v":"-"},{"$f":"IF(B231=\"-\",\"-\",CALCULOS!$F$14+B231)","v":"-"},{"$f":"IF(B231=\"-\",\"-\",D230*(1+CALCULOS!$C$27))","v":"-"},{"$f":"IF(B231=\"-\",\"-\",IF(B231=1,CALCULOS!$C$47,IF(MOD(B230,12)=0,E229*(1+CALCULOS!$C$28),E230))*IF(MOD(B231,12)=0,2,1))","v":"-"},{"$f":"IF(B231=\"-\",\"-\",F230*(1+CALCULOS!$C$27)+E231)","v":"-"},"-"]
[null,{"$f":"IF(OR(B231>=CALCULOS!$F$18,B231=\"-\"),\"-\",B231+1)","v":"-"},{"$f":"IF(B232=\"-\",\"-\",CALCULOS!$F$14+B232)","v":"-"},{"$f":"IF(B232=\"-\",\"-\",D231*(1+CALCULOS!$C$27))","v":"-"},{"$f":"IF(B232=\"-\",\"-\",IF(B232=1,CALCULOS!$C$47,IF(MOD(B231,12)=0,E230*(1+CALCULOS!$C$28),E231))*IF(MOD(B232,12)=0,2,1))","v":"-"},{"$f":"IF(B232=\"-\",\"-\",F231*(1+CALCULOS!$C$27)+E232)","v":"-"},"-"]
[null,{"$f":"IF(OR(B232>=CALCULOS!$F$18,B232=\"-\"),\"-\",B232+1)","v":"-"},{"$f":"IF(B233=\"-\",\"-\",CALCULOS!$F$14+B233)","v":"-"},{"$f":"IF(B233=\"-\",\"-\",D232*(1+CALCULOS!$C$27))","v":"-"},{"$f":"IF(B233=\"-\",\"-\",IF(B233=1,CALCULOS!$C$47,IF(MOD(B232,12)=0,E231*(1+CALCULOS!$C$28),E232))*IF(MOD(B233,12)=0,2,1))","v":"-"},{"$f":"IF(B233=\"-\",\"-\",F232*(1+CALCULOS!$C$27)+E233)","v":"-"},"-"]
[null,{"$f":"IF(OR(B233>=CALCULOS!$F$18,B233=\"-\"),\"-\",B233+1)","v":"-"},{"$f":"IF(B234=\"-\",\"-\",CALCULOS!$F$14+B234)","v":"-"},{"$f":"IF(B234=\"-\",\"-\",D233*(1+CALCULOS!$C$27))","v":"-"},{"$f":"IF(B234=\"-\",\"-\",IF(B234=1,CALCULOS!$C$47,IF(MOD(B233,12)=0,E232*(1+CALCULOS!$C$28),E233))*IF(MOD(B234,12)=0,2,1))","v":"-"},{"$f":"IF(B234=\"-\",\"-\",F233*(1+CALCULOS!$C$27)+E234)","v":"-"},"-"]
[null,{"$f":"IF(OR(B234>=CALCULOS!$F$18,B234=\"-\"),\"-\",B234+1)","v":"-"},{"$f":"IF(B235=\"-\",\"-\",CALCULOS!$F$14+B235)","v":"-"},{"$f":"IF(B235=\"-\",\"-\",D234*(1+CALCULOS!$C$27))","v":"-"},{"$f":"IF(B235=\"-\",\"-\",IF(B235=1,CALCULOS!$C$47,IF(MOD(B234,12)=0,E233*(1+CALCULOS!$C$28),E234))*IF(MOD(B235,12)=0,2,1))","v":"-"},{"$f":"IF(B235=\"-\",\"-\",F234*(1+CALCULOS!$C$27)+E235)","v":"-"},"-"]
[null,{"$f":"IF(OR(B235>=CALCULOS!$F$18,B235=\"-\"),\"-\",B235+1)","v":"-"},{"$f":"IF(B236=\"-\",\"-\",CALCULOS!$F$14+B236)","v":"-"},{"$f":"IF(B236=\"-\",\"-\",D235*(1+CALCULOS!$C$27))","v":"-"},{"$f":"IF(B236=\"-\",\"-\",IF(B236=1,CALCULOS!$C$47,IF(MOD(B235,12)=0,E234*(1+CALCULOS!$C$28),E235))*IF(MOD(B236,12)=0,2,1))","v":"-"},{"$f":"IF(B236=\"-\",\"-\",F235*(1+CALCULOS!$C$27)+E236)","v":"-"},"-"]
[null,{"$f":"IF(OR(B236>=CALCULOS!$F$18,B236=\"-\"),\"-\",B236+1)","v":"-"},{"$f":"IF(B237=\"-\",\"-\",CALCULOS!$F$14+B237)","v":"-"},{"$f":"IF(B237=\"-\",\"-\",D236*(1+CALCULOS!$C$27))","v":"-"},{"$f":"IF(B237=\"-\",\"-\",IF(B237=1,CALCULOS!$C$47,IF(MOD(B236,12)=0,E235*(1+CALCULOS!$C$28),E236))*IF(MOD(B237,12)=0,2,1))","v":"-"},{"$f":"IF(B237=\"-\",\"-\",F236*(1+CALCULOS!$C$27)+E237)","v":"-"},"-"]
[null,{"$f":"IF(OR(B237>=CALCULOS!$F$18,B237=\"-\"),\"-\",B237+1)","v":"-"},{"$f":"IF(B238=\"-\",\"-\",CALCULOS!$F$14+B238)","v":"-"},{"$f":"IF(B238=\"-\",\"-\",D237*(1+CALCULOS!$C$27))","v":"-"},{"$f":"IF(B238=\"-\",\"-\",IF(B238=1,CALCULOS!$C$47,IF(MOD(B237,12)=0,E236*(1+CALCULOS!$C$28),E237))*IF(MOD(B238,12)=0,2,1))","v":"-"},{"$f":"IF(B238=\"-\",\"-\",F237*(1+CALCULOS!$C$27)+E238)","v":"-"},"-"]
[null,{"$f":"IF(OR(B238>=CALCULOS!$F$18,B238=\"-\"),\"-\",B238+1)","v":"-"},{"$f":"IF(B239=\"-\",\"-\",CALCULOS!$F$14+B239)","v":"-"},{"$f":"IF(B239=\"-\",\"-\",D238*(1+CALCULOS!$C$27))","v":"-"},{"$f":"IF(B239=\"-\",\"-\",IF(B239=1,CALCULOS!$C$47,IF(MOD(B238,12)=0,E237*(1+CALCULOS!$C$28),E238))*IF(MOD(B239,12)=0,2,1))","v":"-"},{"$f":"IF(B239=\"-\",\"-\",F238*(1+CALCULOS!$C$27)+E239)","v":"-"},"-"]
[null,{"$f":"IF(OR(B239>=CALCULOS!$F$18,B239=\"-\"),\"-\",B239+1)","v":"-"},{"$f":"IF(B240=\"-\",\"-\",CALCULOS!$F$14+B240)","v":"-"},{"$f":"IF(B240=\"-\",\"-\",D239*(1+CALCULOS!$C$27))","v":"-"},{"$f":"IF(B240=\"-\",\"-\",IF(B240=1,CALCULOS!$C$47,IF(MOD(B239,12)=0,E238*(1+CALCULOS!$C$28),E239))*IF(MOD(B240,12)=0,2,1))","v":"-"},{"$f":"IF(B240=\"-\",\"-\",F239*(1+CALCULOS!$C$27)+E240)","v":"-"},"-"]
[null,{"$f":"IF(OR(B240>=CALCULOS!$F$18,B240=\"-\"),\"-\",B240+1)","v":"-"},{"$f":"IF(B241=\"-\",\"-\",CALCULOS!$F$14+B241)","v":"-"},{"$f":"IF(B241=\"-\",\"-\",D240*(1+CALCULOS!$C$27))","v":"-"},{"$f":"IF(B241=\"-\",\"-\",IF(B241=1,CALCULOS!$C$47,IF(MOD(B240,12)=0,E239*(1+CALCULOS!$C$28),E240))*IF(MOD(B241,12)=0,2,1))","v":"-"},{"$f":"IF(B241=\"-\",\"-\",F240*(1+CALCULOS!$C$27)+E241)","v":"-"},"-"]
[null,{"$f":"IF(OR(B241>=CALCULOS!$F$18,B241=\"-\"),\"-\",B241+1)","v":"-"},{"$f":"IF(B242=\"-\",\"-\",CALCULOS!$F$14+B242)","v":"-"},{"$f":"IF(B242=\"-\",\"-\",D241*(1+CALCULOS!$C$27))","v":"-"},{"$f":"IF(B242=\"-\",\"-\",IF(B242=1,CALCULOS!$C$47,IF(MOD(B241,12)=0,E240*(1+CALCULOS!$C$28),E241))*IF(MOD(B242,12)=0,2,1))","v":"-"},{"$f":"IF(B242=\"-\",\"-\",F241*(1+CALCULOS!$C$27)+E242)","v":"-"},"-"]
[null,{"$f":"IF(OR(B242>=CALCULOS!$F$18,B242=\"-\"),\"-\",B242+1)","v":"-"},{"$f":"IF(B243=\"-\",\"-\",CALCULOS!$F$14+B243)","v":"-"},{"$f":"IF(B243=\"-\",\"-\",D242*(1+CALCULOS!$C$27))","v":"-"},{"$f":"IF(B243=\"-\",\"-\",IF(B243=1,CALCULOS!$C$47,IF(MOD(B242,12)=0,E241*(1+CALCULOS!$C$28),E242))*IF(MOD(B243,12)=0,2,1))","v":"-"},{"$f":"IF(B243=\"-\",\"-\",F242*(1+CALCULOS!$C$27)+E243)","v":"-"},"-"]
[null,{"$f":"IF(OR(B243>=CALCULOS!$F$18,B243=\"-\"),\"-\",B243+1)","v":"-"},{"$f":"IF(B244=\"-\",\"-\",CALCULOS!$F$14+B244)","v":"-"},{"$f":"IF(B244=\"-\",\"-\",D243*(1+CALCULOS!$C$27))","v":"-"},{"$f":"IF(B244=\"-\",\"-\",IF(B244=1,CALCULOS!$C$47,IF(MOD(B243,12)=0,E242*(1+CALCULOS!$C$28),E243))*IF(MOD(B244,12)=0,2,1))","v":"-"},{"$f":"IF(B244=\"-\",\"-\",F243*(1+CALCULOS!$C$27)+E244)","v":"-"},"-"]
[null,{"$f":"IF(OR(B244>=CALCULOS!$F$18,B244=\"-\"),\"-\",B244+1)","v":"-"},{"$f":"IF(B245=\"-\",\"-\",CALCULOS!$F$14+B245)","v":"-"},{"$f":"IF(B245=\"-\",\"-\",D244*(1+CALCULOS!$C$27))","v":"-"},{"$f":"IF(B245=\"-\",\"-\",IF(B245=1,CALCULOS!$C$47,IF(MOD(B244,12)=0,E243*(1+CALCULOS!$C$28),E244))*IF(MOD(B245,12)=0,2,1))","v":"-"},{"$f":"IF(B245=\"-\",\"-\",F244*(1+CALCULOS!$C$27)+E245)","v":"-"},"-"]
[null,{"$f":"IF(OR(B245>=CALCULOS!$F$18,B245=\"-\"),\"-\",B245+1)","v":"-"},{"$f":"IF(B246=\"-\",\"-\",CALCULOS!$F$14+B246)","v":"-"},{"$f":"IF(B246=\"-\",\"-\",D245*(1+CALCULOS!$C$27))","v":"-"},{"$f":"IF(B246=\"-\",\"-\",IF(B246=1,CALCULOS!$C$47,IF(MOD(B245,12)=0,E244*(1+CALCULOS!$C$28),E245))*IF(MOD(B246,12)=0,2,1))","v":"-"},{"$f":"IF(B246=\"-\",\"-\",F245*(1+CALCULOS!$C$27)+E246)","v":"-"},"-"]
[null,{"$f":"IF(OR(B246>=CALCULOS!$F$18,B246=\"-\"),\"-\",B246+1)","v":"-"},{"$f":"IF(B247=\"-\",\"-\",CALCULOS!$F$14+B247)","v":"-"},{"$f":"IF(B247=\"-\",\"-\",D246*(1+CALCULOS!$C$27))","v":"-"},{"$f":"IF(B247=\"-\",\"-\",IF(B247=1,CALCULOS!$C$47,IF(MOD(B246,12)=0,E245*(1+CALCULOS!$C$28),E246))*IF(MOD(B247,12)=0,2,1))","v":"-"},{"$f":"IF(B247=\"-\",\"-\",F246*(1+CALCULOS!$C$27)+E247)","v":"-"},"-"]
[null,{"$f":"IF(OR(B247>=CALCULOS!$F$18,B247=\"-\"),\"-\",B247+1)","v":"-"},{"$f":"IF(B248=\"-\",\"-\",CALCULOS!$F$14+B248)","v":"-"},{"$f":"IF(B248=\"-\",\"-\",D247*(1+CALCULOS!$C$27))","v":"-"},{"$f":"IF(B248=\"-\",\"-\",IF(B248=1,CALCULOS!$C$47,IF(MOD(B247,12)=0,E246*(1+CALCULOS!$C$28),E247))*IF(MOD(B248,12)=0,2,1))","v":"-"},{"$f":"IF(B248=\"-\",\"-\",F247*(1+CALCULOS!$C$27)+E248)","v":"-"},"-"]
[null,{"$f":"IF(OR(B248>=CALCULOS!$F$18,B248=\"-\"),\"-\",B248+1)","v":"-"},{"$f":"IF(B249=\"-\",\"-\",CALCULOS!$F$14+B249)","v":"-"},{"$f":"IF(B249=\"-\",\"-\",D248*(1+CALCULOS!$C$27))","v":"-"},{"$f":"IF(B249=\"-\",\"-\",IF(B249=1,CALCULOS!$C$47,IF(MOD(B248,12)=0,E247*(1+CALCULOS!$C$28),E248))*IF(MOD(B249,12)=0,2,1))","v":"-"},{"$f":"IF(B249=\"-\",\"-\",F248*(1+CALCULOS!$C$27)+E249)","v":"-"},"-"]
[null,{"$f":"IF(OR(B249>=CALCULOS!$F$18,B249=\"-\"),\"-\",B249+1)","v":"-"},{"$f":"IF(B250=\"-\",\"-\",CALCULOS!$F$14+B250)","v":"-"},{"$f":"IF(B250=\"-\",\"-\",D249*(1+CALCULOS!$C$27))","v":"-"},{"$f":"IF(B250=\"-\",\"-\",IF(B250=1,CALCULOS!$C$47,IF(MOD(B249,12)=0,E248*(1+CALCULOS!$C$28),E249))*IF(MOD(B250,12)=0,2,1))","v":"-"},{"$f":"IF(B250=\"-\",\"-\",F249*(1+CALCULOS!$C$27)+E250)","v":"-"},"-"]
[null,{"$f":"IF(OR(B250>=CALCULOS!$F$18,B250=\"-\"),\"-\",B250+1)","v":"-"},{"$f":"IF(B251=\"-\",\"-\",CALCULOS!$F$14+B251)","v":"-"},{"$f":"IF(B251=\"-\",\"-\",D250*(1+CALCULOS!$C$27))","v":"-"},{"$f":"IF(B251=\"-\",\"-\",IF(B251=1,CALCULOS!$C$47,IF(MOD(B250,12)=0,E249*(1+CALCULOS!$C$28),E250))*IF(MOD(B251,12)=0,2,1))","v":"-"},{"$f":"IF(B251=\"-\",\"-\",F250*(1+CALCULOS!$C$27)+E251)","v":"-"},"-"]
[null,{"$f":"IF(OR(B251>=CALCULOS!$F$18,B251=\"-\"),\"-\",B251+1)","v":"-"},{"$f":"IF(B252=\"-\",\"-\",CALCULOS!$F$14+B252)","v":"-"},{"$f":"IF(B252=\"-\",\"-\",D251*(1+CALCULOS!$C$27))","v":"-"},{"$f":"IF(B252=\"-\",\"-\",IF(B252=1,CALCULOS!$C$47,IF(MOD(B251,12)=0,E250*(1+CALCULOS!$C$28),E251))*IF(MOD(B252,12)=0,2,1))","v":"-"},{"$f":"IF(B252=\"-\",\"-\",F251*(1+CALCULOS!$C$27)+E252)","v":"-"},"-"]
[null,{"$f":"IF(OR(B252>=CALCULOS!$F$18,B252=\"-\"),\"-\",B252+1)","v":"-"},{"$f":"IF(B253=\"-\",\"-\",CALCULOS!$F$14+B253)","v":"-"},{"$f":"IF(B253=\"-\",\"-\",D252*(1+CALCULOS!$C$27))","v":"-"},{"$f":"IF(B253=\"-\",\"-\",IF(B253=1,CALCULOS!$C$47,IF(MOD(B252,12)=0,E251*(1+CALCULOS!$C$28),E252))*IF(MOD(B253,12)=0,2,1))","v":"-"},{"$f":"IF(B253=\"-\",\"-\",F252*(1+CALCULOS!$C$27)+E253)","v":"-"},"-"]
[null,{"$f":"IF(OR(B253>=CALCULOS!$F$18,B253=\"-\"),\"-\",B253+1)","v":"-"},{"$f":"IF(B254=\"-\",\"-\",CALCULOS!$F$14+B254)","v":"-"},{"$f":"IF(B254=\"-\",\"-\",D253*(1+CALCULOS!$C$27))","v":"-"},{"$f":"IF(B254=\"-\",\"-\",IF(B254=1,CALCULOS!$C$47,IF(MOD(B253,12)=0,E252*(1+CALCULOS!$C$28),E253))*IF(MOD(B254,12)=0,2,1))","v":"-"},{"$f":"IF(B254=\"-\",\"-\",F253*(1+CALCULOS!$C$27)+E254)","v":"-"},"-"]
[null,{"$f":"IF(OR(B254>=CALCULOS!$F$18,B254=\"-\"),\"-\",B254+1)","v":"-"},{"$f":"IF(B255=\"-\",\"-\",CALCULOS!$F$14+B255)","v":"-"},{"$f":"IF(B255=\"-\",\"-\",D254*(1+CALCULOS!$C$27))","v":"-"},{"$f":"IF(B255=\"-\",\"-\",IF(B255=1,CALCULOS!$C$47,IF(MOD(B254,12)=0,E253*(1+CALCULOS!$C$28),E254))*IF(MOD(B255,12)=0,2,1))","v":"-"},{"$f":"IF(B255=\"-\",\"-\",F254*(1+CALCULOS!$C$27)+E255)","v":"-"},"-"]
[null,{"$f":"IF(OR(B255>=CALCULOS!$F$18,B255=\"-\"),\"-\",B255+1)","v":"-"},{"$f":"IF(B256=\"-\",\"-\",CALCULOS!$F$14+B256)","v":"-"},{"$f":"IF(B256=\"-\",\"-\",D255*(1+CALCULOS!$C$27))","v":"-"},{"$f":"IF(B256=\"-\",\"-\",IF(B256=1,CALCULOS!$C$47,IF(MOD(B255,12)=0,E254*(1+CALCULOS!$C$28),E255))*IF(MOD(B256,12)=0,2,1))","v":"-"},{"$f":"IF(B256=\"-\",\"-\",F255*(1+CALCULOS!$C$27)+E256)","v":"-"},"-"]
[null,{"$f":"IF(OR(B256>=CALCULOS!$F$18,B256=\"-\"),\"-\",B256+1)","v":"-"},{"$f":"IF(B257=\"-\",\"-\",CALCULOS!$F$14+B257)","v":"-"},{"$f":"IF(B257=\"-\",\"-\",D256*(1+CALCULOS!$C$27))","v":"-"},{"$f":"IF(B257=\"-\",\"-\",IF(B257=1,CALCULOS!$C$47,IF(MOD(B256,12)=0,E255*(1+CALCULOS!$C$28),E256))*IF(MOD(B257,12)=0,2,1))","v":"-"},{"$f":"IF(B257=\"-\",\"-\",F256*(1+CALCULOS!$C$27)+E257)","v":"-"},"-"]
[null,{"$f":"IF(OR(B257>=CALCULOS!$F$18,B257=\"-\"),\"-\",B257+1)","v":"-"},{"$f":"IF(B258=\"-\",\"-\",CALCULOS!$F$14+B258)","v":"-"},{"$f":"IF(B258=\"-\",\"-\",D257*(1+CALCULOS!$C$27))","v":"-"},{"$f":"IF(B258=\"-\",\"-\",IF(B258=1,CALCULOS!$C$47,IF(MOD(B257,12)=0,E256*(1+CALCULOS!$C$28),E257))*IF(MOD(B258,12)=0,2,1))","v":"-"},{"$f":"IF(B258=\"-\",\"-\",F257*(1+CALCULOS!$C$27)+E258)","v":"-"},"-"]
[null,{"$f":"IF(OR(B258>=CALCULOS!$F$18,B258=\"-\"),\"-\",B258+1)","v":"-"},{"$f":"IF(B259=\"-\",\"-\",CALCULOS!$F$14+B259)","v":"-"},{"$f":"IF(B259=\"-\",\"-\",D258*(1+CALCULOS!$C$27))","v":"-"},{"$f":"IF(B259=\"-\",\"-\",IF(B259=1,CALCULOS!$C$47,IF(MOD(B258,12)=0,E257*(1+CALCULOS!$C$28),E258))*IF(MOD(B259,12)=0,2,1))","v":"-"},{"$f":"IF(B259=\"-\",\"-\",F258*(1+CALCULOS!$C$27)+E259)","v":"-"},"-"]
[null,{"$f":"IF(OR(B259>=CALCULOS!$F$18,B259=\"-\"),\"-\",B259+1)","v":"-"},{"$f":"IF(B260=\"-\",\"-\",CALCULOS!$F$14+B260)","v":"-"},{"$f":"IF(B260=\"-\",\"-\",D259*(1+CALCULOS!$C$27))","v":"-"},{"$f":"IF(B260=\"-\",\"-\",IF(B260=1,CALCULOS!$C$47,IF(MOD(B259,12)=0,E258*(1+CALCULOS!$C$28),E259))*IF(MOD(B260,12)=0,2,1))","v":"-"},{"$f":"IF(B260=\"-\",\"-\",F259*(1+CALCULOS!$C$27)+E260)","v":"-"},"-"]
[null,{"$f":"IF(OR(B260>=CALCULOS!$F$18,B260=\"-\"),\"-\",B260+1)","v":"-"},{"$f":"IF(B261=\"-\",\"-\",CALCULOS!$F$14+B261)","v":"-"},{"$f":"IF(B261=\"-\",\"-\",D260*(1+CALCULOS!$C$27))","v":"-"},{"$f":"IF(B261=\"-\",\"-\",IF(B261=1,CALCULOS!$C$47,IF(MOD(B260,12)=0,E259*(1+CALCULOS!$C$28),E260))*IF(MOD(B261,12)=0,2,1))","v":"-"},{"$f":"IF(B261=\"-\",\"-\",F260*(1+CALCULOS!$C$27)+E261)","v":"-"},"-"]
[null,{"$f":"IF(OR(B261>=CALCULOS!$F$18,B261=\"-\"),\"-\",B261+1)","v":"-"},{"$f":"IF(B262=\"-\",\"-\",CALCULOS!$F$14+B262)","v":"-"},{"$f":"IF(B262=\"-\",\"-\",D261*(1+CALCULOS!$C$27))","v":"-"},{"$f":"IF(B262=\"-\",\"-\",IF(B262=1,CALCULOS!$C$47,IF(MOD(B261,12)=0,E260*(1+CALCULOS!$C$28),E261))*IF(MOD(B262,12)=0,2,1))","v":"-"},{"$f":"IF(B262=\"-\",\"-\",F261*(1+CALCULOS!$C$27)+E262)","v":"-"},"-"]
[null,{"$f":"IF(OR(B262>=CALCULOS!$F$18,B262=\"-\"),\"-\",B262+1)","v":"-"},{"$f":"IF(B263=\"-\",\"-\",CALCULOS!$F$14+B263)","v":"-"},{"$f":"IF(B263=\"-\",\"-\",D262*(1+CALCULOS!$C$27))","v":"-"},{"$f":"IF(B263=\"-\",\"-\",IF(B263=1,CALCULOS!$C$47,IF(MOD(B262,12)=0,E261*(1+CALCULOS!$C$28),E262))*IF(MOD(B263,12)=0,2,1))","v":"-"},{"$f":"IF(B263=\"-\",\"-\",F262*(1+CALCULOS!$C$27)+E263)","v":"-"},"-"]
[null,{"$f":"IF(OR(B263>=CALCULOS!$F$18,B263=\"-\"),\"-\",B263+1)","v":"-"},{"$f":"IF(B264=\"-\",\"-\",CALCULOS!$F$14+B264)","v":"-"},{"$f":"IF(B264=\"-\",\"-\",D263*(1+CALCULOS!$C$27))","v":"-"},{"$f":"IF(B264=\"-\",\"-\",IF(B264=1,CALCULOS!$C$47,IF(MOD(B263,12)=0,E262*(1+CALCULOS!$C$28),E263))*IF(MOD(B264,12)=0,2,1))","v":"-"},{"$f":"IF(B264=\"-\",\"-\",F263*(1+CALCULOS!$C$27)+E264)","v":"-"},"-"]
[null,{"$f":"IF(OR(B264>=CALCULOS!$F$18,B264=\"-\"),\"-\",B264+1)","v":"-"},{"$f":"IF(B265=\"-\",\"-\",CALCULOS!$F$14+B265)","v":"-"},{"$f":"IF(B265=\"-\",\"-\",D264*(1+CALCULOS!$C$27))","v":"-"},{"$f":"IF(B265=\"-\",\"-\",IF(B265=1,CALCULOS!$C$47,IF(MOD(B264,12)=0,E263*(1+CALCULOS!$C$28),E264))*IF(MOD(B265,12)=0,2,1))","v":"-"},{"$f":"IF(B265=\"-\",\"-\",F264*(1+CALCULOS!$C$27)+E265)","v":"-"},"-"]
[null,{"$f":"IF(OR(B265>=CALCULOS!$F$18,B265=\"-\"),\"-\",B265+1)","v":"-"},{"$f":"IF(B266=\"-\",\"-\",CALCULOS!$F$14+B266)","v":"-"},{"$f":"IF(B266=\"-\",\"-\",D265*(1+CALCULOS!$C$27))","v":"-"},{"$f":"IF(B266=\"-\",\"-\",IF(B266=1,CALCULOS!$C$47,IF(MOD(B265,12)=0,E264*(1+CALCULOS!$C$28),E265))*IF(MOD(B266,12)=0,2,1))","v":"-"},{"$f":"IF(B266=\"-\",\"-\",F265*(1+CALCULOS!$C$27)+E266)","v":"-"},"-"]
[null,{"$f":"IF(OR(B266>=CALCULOS!$F$18,B266=\"-\"),\"-\",B266+1)","v":"-"},{"$f":"IF(B267=\"-\",\"-\",CALCULOS!$F$14+B267)","v":"-"},{"$f":"IF(B267=\"-\",\"-\",D266*(1+CALCULOS!$C$27))","v":"-"},{"$f":"IF(B267=\"-\",\"-\",IF(B267=1,CALCULOS!$C$47,IF(MOD(B266,12)=0,E265*(1+CALCULOS!$C$28),E266))*IF(MOD(B267,12)=0,2,1))","v":"-"},{"$f":"IF(B267=\"-\",\"-\",F266*(1+CALCULOS!$C$27)+E267)","v":"-"},"-"]
[null,{"$f":"IF(OR(B267>=CALCULOS!$F$18,B267=\"-\"),\"-\",B267+1)","v":"-"},{"$f":"IF(B268=\"-\",\"-\",CALCULOS!$F$14+B268)","v":"-"},{"$f":"IF(B268=\"-\",\"-\",D267*(1+CALCULOS!$C$27))","v":"-"},{"$f":"IF(B268=\"-\",\"-\",IF(B268=1,CALCULOS!$C$47,IF(MOD(B267,12)=0,E266*(1+CALCULOS!$C$28),E267))*IF(MOD(B268,12)=0,2,1))","v":"-"},{"$f":"IF(B268=\"-\",\"-\",F267*(1+CALCULOS!$C$27)+E268)","v":"-"},"-"]
[null,{"$f":"IF(OR(B268>=CALCULOS!$F$18,B268=\"-\"),\"-\",B268+1)","v":"-"},{"$f":"IF(B269=\"-\",\"-\",CALCULOS!$F$14+B269)","v":"-"},{"$f":"IF(B269=\"-\",\"-\",D268*(1+CALCULOS!$C$27))","v":"-"},{"$f":"IF(B269=\"-\",\"-\",IF(B269=1,CALCULOS!$C$47,IF(MOD(B268,12)=0,E267*(1+CALCULOS!$C$28),E268))*IF(MOD(B269,12)=0,2,1))","v":"-"},{"$f":"IF(B269=\"-\",\"-\",F268*(1+CALCULOS!$C$27)+E269)","v":"-"},"-"]
[null,{"$f":"IF(OR(B269>=CALCULOS!$F$18,B269=\"-\"),\"-\",B269+1)","v":"-"},{"$f":"IF(B270=\"-\",\"-\",CALCULOS!$F$14+B270)","v":"-"},{"$f":"IF(B270=\"-\",\"-\",D269*(1+CALCULOS!$C$27))","v":"-"},{"$f":"IF(B270=\"-\",\"-\",IF(B270=1,CALCULOS!$C$47,IF(MOD(B269,12)=0,E268*(1+CALCULOS!$C$28),E269))*IF(MOD(B270,12)=0,2,1))","v":"-"},{"$f":"IF(B270=\"-\",\"-\",F269*(1+CALCULOS!$C$27)+E270)","v":"-"},"-"]
[null,{"$f":"IF(OR(B270>=CALCULOS!$F$18,B270=\"-\"),\"-\",B270+1)","v":"-"},{"$f":"IF(B271=\"-\",\"-\",CALCULOS!$F$14+B271)","v":"-"},{"$f":"IF(B271=\"-\",\"-\",D270*(1+CALCULOS!$C$27))","v":"-"},{"$f":"IF(B271=\"-\",\"-\",IF(B271=1,CALCULOS!$C$47,IF(MOD(B270,12)=0,E269*(1+CALCULOS!$C$28),E270))*IF(MOD(B271,12)=0,2,1))","v":"-"},{"$f":"IF(B271=\"-\",\"-\",F270*(1+CALCULOS!$C$27)+E271)","v":"-"},"-"]
[null,{"$f":"IF(OR(B271>=CALCULOS!$F$18,B271=\"-\"),\"-\",B271+1)","v":"-"},{"$f":"IF(B272=\"-\",\"-\",CALCULOS!$F$14+B272)","v":"-"},{"$f":"IF(B272=\"-\",\"-\",D271*(1+CALCULOS!$C$27))","v":"-"},{"$f":"IF(B272=\"-\",\"-\",IF(B272=1,CALCULOS!$C$47,IF(MOD(B271,12)=0,E270*(1+CALCULOS!$C$28),E271))*IF(MOD(B272,12)=0,2,1))","v":"-"},{"$f":"IF(B272=\"-\",\"-\",F271*(1+CALCULOS!$C$27)+E272)","v":"-"},"-"]
[null,{"$f":"IF(OR(B272>=CALCULOS!$F$18,B272=\"-\"),\"-\",B272+1)","v":"-"},{"$f":"IF(B273=\"-\",\"-\",CALCULOS!$F$14+B273)","v":"-"},{"$f":"IF(B273=\"-\",\"-\",D272*(1+CALCULOS!$C$27))","v":"-"},{"$f":"IF(B273=\"-\",\"-\",IF(B273=1,CALCULOS!$C$47,IF(MOD(B272,12)=0,E271*(1+CALCULOS!$C$28),E272))*IF(MOD(B273,12)=0,2,1))","v":"-"},{"$f":"IF(B273=\"-\",\"-\",F272*(1+CALCULOS!$C$27)+E273)","v":"-"},"-"]
[null,{"$f":"IF(OR(B273>=CALCULOS!$F$18,B273=\"-\"),\"-\",B273+1)","v":"-"},{"$f":"IF(B274=\"-\",\"-\",CALCULOS!$F$14+B274)","v":"-"},{"$f":"IF(B274=\"-\",\"-\",D273*(1+CALCULOS!$C$27))","v":"-"},{"$f":"IF(B274=\"-\",\"-\",IF(B274=1,CALCULOS!$C$47,IF(MOD(B273,12)=0,E272*(1+CALCULOS!$C$28),E273))*IF(MOD(B274,12)=0,2,1))","v":"-"},{"$f":"IF(B274=\"-\",\"-\",F273*(1+CALCULOS!$C$27)+E274)","v":"-"},"-"]
[null,{"$f":"IF(OR(B274>=CALCULOS!$F$18,B274=\"-\"),\"-\",B274+1)","v":"-"},{"$f":"IF(B275=\"-\",\"-\",CALCULOS!$F$14+B275)","v":"-"},{"$f":"IF(B275=\"-\",\"-\",D274*(1+CALCULOS!$C$27))","v":"-"},{"$f":"IF(B275=\"-\",\"-\",IF(B275=1,CALCULOS!$C$47,IF(MOD(B274,12)=0,E273*(1+CALCULOS!$C$28),E274))*IF(MOD(B275,12)=0,2,1))","v":"-"},{"$f":"IF(B275=\"-\",\"-\",F274*(1+CALCULOS!$C$27)+E275)","v":"-"},"-"]
[null,{"$f":"IF(OR(B275>=CALCULOS!$F$18,B275=\"-\"),\"-\",B275+1)","v":"-"},{"$f":"IF(B276=\"-\",\"-\",CALCULOS!$F$14+B276)","v":"-"},{"$f":"IF(B276=\"-\",\"-\",D275*(1+CALCULOS!$C$27))","v":"-"},{"$f":"IF(B276=\"-\",\"-\",IF(B276=1,CALCULOS!$C$47,IF(MOD(B275,12)=0,E274*(1+CALCULOS!$C$28),E275))*IF(MOD(B276,12)=0,2,1))","v":"-"},{"$f":"IF(B276=\"-\",\"-\",F275*(1+CALCULOS!$C$27)+E276)","v":"-"},"-"]
[null,{"$f":"IF(OR(B276>=CALCULOS!$F$18,B276=\"-\"),\"-\",B276+1)","v":"-"},{"$f":"IF(B277=\"-\",\"-\",CALCULOS!$F$14+B277)","v":"-"},{"$f":"IF(B277=\"-\",\"-\",D276*(1+CALCULOS!$C$27))","v":"-"},{"$f":"IF(B277=\"-\",\"-\",IF(B277=1,CALCULOS!$C$47,IF(MOD(B276,12)=0,E275*(1+CALCULOS!$C$28),E276))*IF(MOD(B277,12)=0,2,1))","v":"-"},{"$f":"IF(B277=\"-\",\"-\",F276*(1+CALCULOS!$C$27)+E277)","v":"-"},"-"]
[null,{"$f":"IF(OR(B277>=CALCULOS!$F$18,B277=\"-\"),\"-\",B277+1)","v":"-"},{"$f":"IF(B278=\"-\",\"-\",CALCULOS!$F$14+B278)","v":"-"},{"$f":"IF(B278=\"-\",\"-\",D277*(1+CALCULOS!$C$27))","v":"-"},{"$f":"IF(B278=\"-\",\"-\",IF(B278=1,CALCULOS!$C$47,IF(MOD(B277,12)=0,E276*(1+CALCULOS!$C$28),E277))*IF(MOD(B278,12)=0,2,1))","v":"-"},{"$f":"IF(B278=\"-\",\"-\",F277*(1+CALCULOS!$C$27)+E278)","v":"-"},"-"]
[null,{"$f":"IF(OR(B278>=CALCULOS!$F$18,B278=\"-\"),\"-\",B278+1)","v":"-"},{"$f":"IF(B279=\"-\",\"-\",CALCULOS!$F$14+B279)","v":"-"},{"$f":"IF(B279=\"-\",\"-\",D278*(1+CALCULOS!$C$27))","v":"-"},{"$f":"IF(B279=\"-\",\"-\",IF(B279=1,CALCULOS!$C$47,IF(MOD(B278,12)=0,E277*(1+CALCULOS!$C$28),E278))*IF(MOD(B279,12)=0,2,1))","v":"-"},{"$f":"IF(B279=\"-\",\"-\",F278*(1+CALCULOS!$C$27)+E279)","v":"-"},"-"]
[null,{"$f":"IF(OR(B279>=CALCULOS!$F$18,B279=\"-\"),\"-\",B279+1)","v":"-"},{"$f":"IF(B280=\"-\",\"-\",CALCULOS!$F$14+B280)","v":"-"},{"$f":"IF(B280=\"-\",\"-\",D279*(1+CALCULOS!$C$27))","v":"-"},{"$f":"IF(B280=\"-\",\"-\",IF(B280=1,CALCULOS!$C$47,IF(MOD(B279,12)=0,E278*(1+CALCULOS!$C$28),E279))*IF(MOD(B280,12)=0,2,1))","v":"-"},{"$f":"IF(B280=\"-\",\"-\",F279*(1+CALCULOS!$C$27)+E280)","v":"-"},"-"]
[null,{"$f":"IF(OR(B280>=CALCULOS!$F$18,B280=\"-\"),\"-\",B280+1)","v":"-"},{"$f":"IF(B281=\"-\",\"-\",CALCULOS!$F$14+B281)","v":"-"},{"$f":"IF(B281=\"-\",\"-\",D280*(1+CALCULOS!$C$27))","v":"-"},{"$f":"IF(B281=\"-\",\"-\",IF(B281=1,CALCULOS!$C$47,IF(MOD(B280,12)=0,E279*(1+CALCULOS!$C$28),E280))*IF(MOD(B281,12)=0,2,1))","v":"-"},{"$f":"IF(B281=\"-\",\"-\",F280*(1+CALCULOS!$C$27)+E281)","v":"-"},{"$f":"IF(B281=\"-\",\"-\",SUM(D281,F281))","v":"-"}]
[null,{"$f":"IF(OR(B281>=CALCULOS!$F$18,B281=\"-\"),\"-\",B281+1)","v":"-"},{"$f":"IF(B282=\"-\",\"-\",CALCULOS!$F$14+B282)","v":"-"},{"$f":"IF(B282=\"-\",\"-\",D281*(1+CALCULOS!$C$27))","v":"-"},{"$f":"IF(B282=\"-\",\"-\",IF(B282=1,CALCULOS!$C$47,IF(MOD(B281,12)=0,E280*(1+CALCULOS!$C$28),E281))*IF(MOD(B282,12)=0,2,1))","v":"-"},{"$f":"IF(B282=\"-\",\"-\",F281*(1+CALCULOS!$C$27)+E282)","v":"-"},"-"]
[null,{"$f":"IF(OR(B282>=CALCULOS!$F$18,B282=\"-\"),\"-\",B282+1)","v":"-"},{"$f":"IF(B283=\"-\",\"-\",CALCULOS!$F$14+B283)","v":"-"},{"$f":"IF(B283=\"-\",\"-\",D282*(1+CALCULOS!$C$27))","v":"-"},{"$f":"IF(B283=\"-\",\"-\",IF(B283=1,CALCULOS!$C$47,IF(MOD(B282,12)=0,E281*(1+CALCULOS!$C$28),E282))*IF(MOD(B283,12)=0,2,1))","v":"-"},{"$f":"IF(B283=\"-\",\"-\",F282*(1+CALCULOS!$C$27)+E283)","v":"-"},"-"]
[null,{"$f":"IF(OR(B283>=CALCULOS!$F$18,B283=\"-\"),\"-\",B283+1)","v":"-"},{"$f":"IF(B284=\"-\",\"-\",CALCULOS!$F$14+B284)","v":"-"},{"$f":"IF(B284=\"-\",\"-\",D283*(1+CALCULOS!$C$27))","v":"-"},{"$f":"IF(B284=\"-\",\"-\",IF(B284=1,CALCULOS!$C$47,IF(MOD(B283,12)=0,E282*(1+CALCULOS!$C$28),E283))*IF(MOD(B284,12)=0,2,1))","v":"-"},{"$f":"IF(B284=\"-\",\"-\",F283*(1+CALCULOS!$C$27)+E284)","v":"-"},"-"]
[null,{"$f":"IF(OR(B284>=CALCULOS!$F$18,B284=\"-\"),\"-\",B284+1)","v":"-"},{"$f":"IF(B285=\"-\",\"-\",CALCULOS!$F$14+B285)","v":"-"},{"$f":"IF(B285=\"-\",\"-\",D284*(1+CALCULOS!$C$27))","v":"-"},{"$f":"IF(B285=\"-\",\"-\",IF(B285=1,CALCULOS!$C$47,IF(MOD(B284,12)=0,E283*(1+CALCULOS!$C$28),E284))*IF(MOD(B285,12)=0,2,1))","v":"-"},{"$f":"IF(B285=\"-\",\"-\",F284*(1+CALCULOS!$C$27)+E285)","v":"-"},"-"]
[null,{"$f":"IF(OR(B285>=CALCULOS!$F$18,B285=\"-\"),\"-\",B285+1)","v":"-"},{"$f":"IF(B286=\"-\",\"-\",CALCULOS!$F$14+B286)","v":"-"},{"$f":"IF(B286=\"-\",\"-\",D285*(1+CALCULOS!$C$27))","v":"-"},{"$f":"IF(B286=\"-\",\"-\",IF(B286=1,CALCULOS!$C$47,IF(MOD(B285,12)=0,E284*(1+CALCULOS!$C$28),E285))*IF(MOD(B286,12)=0,2,1))","v":"-"},{"$f":"IF(B286=\"-\",\"-\",F285*(1+CALCULOS!$C$27)+E286)","v":"-"},"-"]
[null,{"$f":"IF(OR(B286>=CALCULOS!$F$18,B286=\"-\"),\"-\",B286+1)","v":"-"},{"$f":"IF(B287=\"-\",\"-\",CALCULOS!$F$14+B287)","v":"-"},{"$f":"IF(B287=\"-\",\"-\",D286*(1+CALCULOS!$C$27))","v":"-"},{"$f":"IF(B287=\"-\",\"-\",IF(B287=1,CALCULOS!$C$47,IF(MOD(B286,12)=0,E285*(1+CALCULOS!$C$28),E286))*IF(MOD(B287,12)=0,2,1))","v":"-"},{"$f":"IF(B287=\"-\",\"-\",F286*(1+CALCULOS!$C$27)+E287)","v":"-"},"-"]
[null,{"$f":"IF(OR(B287>=CALCULOS!$F$18,B287=\"-\"),\"-\",B287+1)","v":"-"},{"$f":"IF(B288=\"-\",\"-\",CALCULOS!$F$14+B288)","v":"-"},{"$f":"IF(B288=\"-\",\"-\",D287*(1+CALCULOS!$C$27))","v":"-"},{"$f":"IF(B288=\"-\",\"-\",IF(B288=1,CALCULOS!$C$47,IF(MOD(B287,12)=0,E286*(1+CALCULOS!$C$28),E287))*IF(MOD(B288,12)=0,2,1))","v":"-"},{"$f":"IF(B288=\"-\",\"-\",F287*(1+CALCULOS!$C$27)+E288)","v":"-"},"-"]
[null,{"$f":"IF(OR(B288>=CALCULOS!$F$18,B288=\"-\"),\"-\",B288+1)","v":"-"},{"$f":"IF(B289=\"-\",\"-\",CALCULOS!$F$14+B289)","v":"-"},{"$f":"IF(B289=\"-\",\"-\",D288*(1+CALCULOS!$C$27))","v":"-"},{"$f":"IF(B289=\"-\",\"-\",IF(B289=1,CALCULOS!$C$47,IF(MOD(B288,12)=0,E287*(1+CALCULOS!$C$28),E288))*IF(MOD(B289,12)=0,2,1))","v":"-"},{"$f":"IF(B289=\"-\",\"-\",F288*(1+CALCULOS!$C$27)+E289)","v":"-"},"-"]
[null,{"$f":"IF(OR(B289>=CALCULOS!$F$18,B289=\"-\"),\"-\",B289+1)","v":"-"},{"$f":"IF(B290=\"-\",\"-\",CALCULOS!$F$14+B290)","v":"-"},{"$f":"IF(B290=\"-\",\"-\",D289*(1+CALCULOS!$C$27))","v":"-"},{"$f":"IF(B290=\"-\",\"-\",IF(B290=1,CALCULOS!$C$47,IF(MOD(B289,12)=0,E288*(1+CALCULOS!$C$28),E289))*IF(MOD(B290,12)=0,2,1))","v":"-"},{"$f":"IF(B290=\"-\",\"-\",F289*(1+CALCULOS!$C$27)+E290)","v":"-"},"-"]
[null,{"$f":"IF(OR(B290>=CALCULOS!$F$18,B290=\"-\"),\"-\",B290+1)","v":"-"},{"$f":"IF(B291=\"-\",\"-\",CALCULOS!$F$14+B291)","v":"-"},{"$f":"IF(B291=\"-\",\"-\",D290*(1+CALCULOS!$C$27))","v":"-"},{"$f":"IF(B291=\"-\",\"-\",IF(B291=1,CALCULOS!$C$47,IF(MOD(B290,12)=0,E289*(1+CALCULOS!$C$28),E290))*IF(MOD(B291,12)=0,2,1))","v":"-"},{"$f":"IF(B291=\"-\",\"-\",F290*(1+CALCULOS!$C$27)+E291)","v":"-"},"-"]
[null,{"$f":"IF(OR(B291>=CALCULOS!$F$18,B291=\"-\"),\"-\",B291+1)","v":"-"},{"$f":"IF(B292=\"-\",\"-\",CALCULOS!$F$14+B292)","v":"-"},{"$f":"IF(B292=\"-\",\"-\",D291*(1+CALCULOS!$C$27))","v":"-"},{"$f":"IF(B292=\"-\",\"-\",IF(B292=1,CALCULOS!$C$47,IF(MOD(B291,12)=0,E290*(1+CALCULOS!$C$28),E291))*IF(MOD(B292,12)=0,2,1))","v":"-"},{"$f":"IF(B292=\"-\",\"-\",F291*(1+CALCULOS!$C$27)+E292)","v":"-"},"-"]
[null,{"$f":"IF(OR(B292>=CALCULOS!$F$18,B292=\"-\"),\"-\",B292+1)","v":"-"},{"$f":"IF(B293=\"-\",\"-\",CALCULOS!$F$14+B293)","v":"-"},{"$f":"IF(B293=\"-\",\"-\",D292*(1+CALCULOS!$C$27))","v":"-"},{"$f":"IF(B293=\"-\",\"-\",IF(B293=1,CALCULOS!$C$47,IF(MOD(B292,12)=0,E291*(1+CALCULOS!$C$28),E292))*IF(MOD(B293,12)=0,2,1))","v":"-"},{"$f":"IF(B293=\"-\",\"-\",F292*(1+CALCULOS!$C$27)+E293)","v":"-"},"-"]
[null,{"$f":"IF(OR(B293>=CALCULOS!$F$18,B293=\"-\"),\"-\",B293+1)","v":"-"},{"$f":"IF(B294=\"-\",\"-\",CALCULOS!$F$14+B294)","v":"-"},{"$f":"IF(B294=\"-\",\"-\",D293*(1+CALCULOS!$C$27))","v":"-"},{"$f":"IF(B294=\"-\",\"-\",IF(B294=1,CALCULOS!$C$47,IF(MOD(B293,12)=0,E292*(1+CALCULOS!$C$28),E293))*IF(MOD(B294,12)=0,2,1))","v":"-"},{"$f":"IF(B294=\"-\",\"-\",F293*(1+CALCULOS!$C$27)+E294)","v":"-"},"-"]
[null,{"$f":"IF(OR(B294>=CALCULOS!$F$18,B294=\"-\"),\"-\",B294+1)","v":"-"},{"$f":"IF(B295=\"-\",\"-\",CALCULOS!$F$14+B295)","v":"-"},{"$f":"IF(B295=\"-\",\"-\",D294*(1+CALCULOS!$C$27))","v":"-"},{"$f":"IF(B295=\"-\",\"-\",IF(B295=1,CALCULOS!$C$47,IF(MOD(B294,12)=0,E293*(1+CALCULOS!$C$28),E294))*IF(MOD(B295,12)=0,2,1))","v":"-"},{"$f":"IF(B295=\"-\",\"-\",F294*(1+CALCULOS!$C$27)+E295)","v":"-"},"-"]
[null,{"$f":"IF(OR(B295>=CALCULOS!$F$18,B295=\"-\"),\"-\",B295+1)","v":"-"},{"$f":"IF(B296=\"-\",\"-\",CALCULOS!$F$14+B296)","v":"-"},{"$f":"IF(B296=\"-\",\"-\",D295*(1+CALCULOS!$C$27))","v":"-"},{"$f":"IF(B296=\"-\",\"-\",IF(B296=1,CALCULOS!$C$47,IF(MOD(B295,12)=0,E294*(1+CALCULOS!$C$28),E295))*IF(MOD(B296,12)=0,2,1))","v":"-"},{"$f":"IF(B296=\"-\",\"-\",F295*(1+CALCULOS!$C$27)+E296)","v":"-"},"-"]
[null,{"$f":"IF(OR(B296>=CALCULOS!$F$18,B296=\"-\"),\"-\",B296+1)","v":"-"},{"$f":"IF(B297=\"-\",\"-\",CALCULOS!$F$14+B297)","v":"-"},{"$f":"IF(B297=\"-\",\"-\",D296*(1+CALCULOS!$C$27))","v":"-"},{"$f":"IF(B297=\"-\",\"-\",IF(B297=1,CALCULOS!$C$47,IF(MOD(B296,12)=0,E295*(1+CALCULOS!$C$28),E296))*IF(MOD(B297,12)=0,2,1))","v":"-"},{"$f":"IF(B297=\"-\",\"-\",F296*(1+CALCULOS!$C$27)+E297)","v":"-"},"-"]
[null,{"$f":"IF(OR(B297>=CALCULOS!$F$18,B297=\"-\"),\"-\",B297+1)","v":"-"},{"$f":"IF(B298=\"-\",\"-\",CALCULOS!$F$14+B298)","v":"-"},{"$f":"IF(B298=\"-\",\"-\",D297*(1+CALCULOS!$C$27))","v":"-"},{"$f":"IF(B298=\"-\",\"-\",IF(B298=1,CALCULOS!$C$47,IF(MOD(B297,12)=0,E296*(1+CALCULOS!$C$28),E297))*IF(MOD(B298,12)=0,2,1))","v":"-"},{"$f":"IF(B298=\"-\",\"-\",F297*(1+CALCULOS!$C$27)+E298)","v":"-"},"-"]
[null,{"$f":"IF(OR(B298>=CALCULOS!$F$18,B298=\"-\"),\"-\",B298+1)","v":"-"},{"$f":"IF(B299=\"-\",\"-\",CALCULOS!$F$14+B299)","v":"-"},{"$f":"IF(B299=\"-\",\"-\",D298*(1+CALCULOS!$C$27))","v":"-"},{"$f":"IF(B299=\"-\",\"-\",IF(B299=1,CALCULOS!$C$47,IF(MOD(B298,12)=0,E297*(1+CALCULOS!$C$28),E298))*IF(MOD(B299,12)=0,2,1))","v":"-"},{"$f":"IF(B299=\"-\",\"-\",F298*(1+CALCULOS!$C$27)+E299)","v":"-"},"-"]
[null,{"$f":"IF(OR(B299>=CALCULOS!$F$18,B299=\"-\"),\"-\",B299+1)","v":"-"},{"$f":"IF(B300=\"-\",\"-\",CALCULOS!$F$14+B300)","v":"-"},{"$f":"IF(B300=\"-\",\"-\",D299*(1+CALCULOS!$C$27))","v":"-"},{"$f":"IF(B300=\"-\",\"-\",IF(B300=1,CALCULOS!$C$47,IF(MOD(B299,12)=0,E298*(1+CALCULOS!$C$28),E299))*IF(MOD(B300,12)=0,2,1))","v":"-"},{"$f":"IF(B300=\"-\",\"-\",F299*(1+CALCULOS!$C$27)+E300)","v":"-"},"-"]
[null,{"$f":"IF(OR(B300>=CALCULOS!$F$18,B300=\"-\"),\"-\",B300+1)","v":"-"},{"$f":"IF(B301=\"-\",\"-\",CALCULOS!$F$14+B301)","v":"-"},{"$f":"IF(B301=\"-\",\"-\",D300*(1+CALCULOS!$C$27))","v":"-"},{"$f":"IF(B301=\"-\",\"-\",IF(B301=1,CALCULOS!$C$47,IF(MOD(B300,12)=0,E299*(1+CALCULOS!$C$28),E300))*IF(MOD(B301,12)=0,2,1))","v":"-"},{"$f":"IF(B301=\"-\",\"-\",F300*(1+CALCULOS!$C$27)+E301)","v":"-"},"-"]
[null,{"$f":"IF(OR(B301>=CALCULOS!$F$18,B301=\"-\"),\"-\",B301+1)","v":"-"},{"$f":"IF(B302=\"-\",\"-\",CALCULOS!$F$14+B302)","v":"-"},{"$f":"IF(B302=\"-\",\"-\",D301*(1+CALCULOS!$C$27))","v":"-"},{"$f":"IF(B302=\"-\",\"-\",IF(B302=1,CALCULOS!$C$47,IF(MOD(B301,12)=0,E300*(1+CALCULOS!$C$28),E301))*IF(MOD(B302,12)=0,2,1))","v":"-"},{"$f":"IF(B302=\"-\",\"-\",F301*(1+CALCULOS!$C$27)+E302)","v":"-"},"-"]
[null,{"$f":"IF(OR(B302>=CALCULOS!$F$18,B302=\"-\"),\"-\",B302+1)","v":"-"},{"$f":"IF(B303=\"-\",\"-\",CALCULOS!$F$14+B303)","v":"-"},{"$f":"IF(B303=\"-\",\"-\",D302*(1+CALCULOS!$C$27))","v":"-"},{"$f":"IF(B303=\"-\",\"-\",IF(B303=1,CALCULOS!$C$47,IF(MOD(B302,12)=0,E301*(1+CALCULOS!$C$28),E302))*IF(MOD(B303,12)=0,2,1))","v":"-"},{"$f":"IF(B303=\"-\",\"-\",F302*(1+CALCULOS!$C$27)+E303)","v":"-"},"-"]
[null,{"$f":"IF(OR(B303>=CALCULOS!$F$18,B303=\"-\"),\"-\",B303+1)","v":"-"},{"$f":"IF(B304=\"-\",\"-\",CALCULOS!$F$14+B304)","v":"-"},{"$f":"IF(B304=\"-\",\"-\",D303*(1+CALCULOS!$C$27))","v":"-"},{"$f":"IF(B304=\"-\",\"-\",IF(B304=1,CALCULOS!$C$47,IF(MOD(B303,12)=0,E302*(1+CALCULOS!$C$28),E303))*IF(MOD(B304,12)=0,2,1))","v":"-"},{"$f":"IF(B304=\"-\",\"-\",F303*(1+CALCULOS!$C$27)+E304)","v":"-"},"-"]
[null,{"$f":"IF(OR(B304>=CALCULOS!$F$18,B304=\"-\"),\"-\",B304+1)","v":"-"},{"$f":"IF(B305=\"-\",\"-\",CALCULOS!$F$14+B305)","v":"-"},{"$f":"IF(B305=\"-\",\"-\",D304*(1+CALCULOS!$C$27))","v":"-"},{"$f":"IF(B305=\"-\",\"-\",IF(B305=1,CALCULOS!$C$47,IF(MOD(B304,12)=0,E303*(1+CALCULOS!$C$28),E304))*IF(MOD(B305,12)=0,2,1))","v":"-"},{"$f":"IF(B305=\"-\",\"-\",F304*(1+CALCULOS!$C$27)+E305)","v":"-"},"-"]
[null,{"$f":"IF(OR(B305>=CALCULOS!$F$18,B305=\"-\"),\"-\",B305+1)","v":"-"},{"$f":"IF(B306=\"-\",\"-\",CALCULOS!$F$14+B306)","v":"-"},{"$f":"IF(B306=\"-\",\"-\",D305*(1+CALCULOS!$C$27))","v":"-"},{"$f":"IF(B306=\"-\",\"-\",IF(B306=1,CALCULOS!$C$47,IF(MOD(B305,12)=0,E304*(1+CALCULOS!$C$28),E305))*IF(MOD(B306,12)=0,2,1))","v":"-"},{"$f":"IF(B306=\"-\",\"-\",F305*(1+CALCULOS!$C$27)+E306)","v":"-"},"-"]
[null,{"$f":"IF(OR(B306>=CALCULOS!$F$18,B306=\"-\"),\"-\",B306+1)","v":"-"},{"$f":"IF(B307=\"-\",\"-\",CALCULOS!$F$14+B307)","v":"-"},{"$f":"IF(B307=\"-\",\"-\",D306*(1+CALCULOS!$C$27))","v":"-"},{"$f":"IF(B307=\"-\",\"-\",IF(B307=1,CALCULOS!$C$47,IF(MOD(B306,12)=0,E305*(1+CALCULOS!$C$28),E306))*IF(MOD(B307,12)=0,2,1))","v":"-"},{"$f":"IF(B307=\"-\",\"-\",F306*(1+CALCULOS!$C$27)+E307)","v":"-"},"-"]
[null,{"$f":"IF(OR(B307>=CALCULOS!$F$18,B307=\"-\"),\"-\",B307+1)","v":"-"},{"$f":"IF(B308=\"-\",\"-\",CALCULOS!$F$14+B308)","v":"-"},{"$f":"IF(B308=\"-\",\"-\",D307*(1+CALCULOS!$C$27))","v":"-"},{"$f":"IF(B308=\"-\",\"-\",IF(B308=1,CALCULOS!$C$47,IF(MOD(B307,12)=0,E306*(1+CALCULOS!$C$28),E307))*IF(MOD(B308,12)=0,2,1))","v":"-"},{"$f":"IF(B308=\"-\",\"-\",F307*(1+CALCULOS!$C$27)+E308)","v":"-"},"-"]
[null,{"$f":"IF(OR(B308>=CALCULOS!$F$18,B308=\"-\"),\"-\",B308+1)","v":"-"},{"$f":"IF(B309=\"-\",\"-\",CALCULOS!$F$14+B309)","v":"-"},{"$f":"IF(B309=\"-\",\"-\",D308*(1+CALCULOS!$C$27))","v":"-"},{"$f":"IF(B309=\"-\",\"-\",IF(B309=1,CALCULOS!$C$47,IF(MOD(B308,12)=0,E307*(1+CALCULOS!$C$28),E308))*IF(MOD(B309,12)=0,2,1))","v":"-"},{"$f":"IF(B309=\"-\",\"-\",F308*(1+CALCULOS!$C$27)+E309)","v":"-"},"-"]
[null,{"$f":"IF(OR(B309>=CALCULOS!$F$18,B309=\"-\"),\"-\",B309+1)","v":"-"},{"$f":"IF(B310=\"-\",\"-\",CALCULOS!$F$14+B310)","v":"-"},{"$f":"IF(B310=\"-\",\"-\",D309*(1+CALCULOS!$C$27))","v":"-"},{"$f":"IF(B310=\"-\",\"-\",IF(B310=1,CALCULOS!$C$47,IF(MOD(B309,12)=0,E308*(1+CALCULOS!$C$28),E309))*IF(MOD(B310,12)=0,2,1))","v":"-"},{"$f":"IF(B310=\"-\",\"-\",F309*(1+CALCULOS!$C$27)+E310)","v":"-"},"-"]
[null,{"$f":"IF(OR(B310>=CALCULOS!$F$18,B310=\"-\"),\"-\",B310+1)","v":"-"},{"$f":"IF(B311=\"-\",\"-\",CALCULOS!$F$14+B311)","v":"-"},{"$f":"IF(B311=\"-\",\"-\",D310*(1+CALCULOS!$C$27))","v":"-"},{"$f":"IF(B311=\"-\",\"-\",IF(B311=1,CALCULOS!$C$47,IF(MOD(B310,12)=0,E309*(1+CALCULOS!$C$28),E310))*IF(MOD(B311,12)=0,2,1))","v":"-"},{"$f":"IF(B311=\"-\",\"-\",F310*(1+CALCULOS!$C$27)+E311)","v":"-"},"-"]
[null,{"$f":"IF(OR(B311>=CALCULOS!$F$18,B311=\"-\"),\"-\",B311+1)","v":"-"},{"$f":"IF(B312=\"-\",\"-\",CALCULOS!$F$14+B312)","v":"-"},{"$f":"IF(B312=\"-\",\"-\",D311*(1+CALCULOS!$C$27))","v":"-"},{"$f":"IF(B312=\"-\",\"-\",IF(B312=1,CALCULOS!$C$47,IF(MOD(B311,12)=0,E310*(1+CALCULOS!$C$28),E311))*IF(MOD(B312,12)=0,2,1))","v":"-"},{"$f":"IF(B312=\"-\",\"-\",F311*(1+CALCULOS!$C$27)+E312)","v":"-"},"-"]
[null,{"$f":"IF(OR(B312>=CALCULOS!$F$18,B312=\"-\"),\"-\",B312+1)","v":"-"},{"$f":"IF(B313=\"-\",\"-\",CALCULOS!$F$14+B313)","v":"-"},{"$f":"IF(B313=\"-\",\"-\",D312*(1+CALCULOS!$C$27))","v":"-"},{"$f":"IF(B313=\"-\",\"-\",IF(B313=1,CALCULOS!$C$47,IF(MOD(B312,12)=0,E311*(1+CALCULOS!$C$28),E312))*IF(MOD(B313,12)=0,2,1))","v":"-"},{"$f":"IF(B313=\"-\",\"-\",F312*(1+CALCULOS!$C$27)+E313)","v":"-"},"-"]
[null,{"$f":"IF(OR(B313>=CALCULOS!$F$18,B313=\"-\"),\"-\",B313+1)","v":"-"},{"$f":"IF(B314=\"-\",\"-\",CALCULOS!$F$14+B314)","v":"-"},{"$f":"IF(B314=\"-\",\"-\",D313*(1+CALCULOS!$C$27))","v":"-"},{"$f":"IF(B314=\"-\",\"-\",IF(B314=1,CALCULOS!$C$47,IF(MOD(B313,12)=0,E312*(1+CALCULOS!$C$28),E313))*IF(MOD(B314,12)=0,2,1))","v":"-"},{"$f":"IF(B314=\"-\",\"-\",F313*(1+CALCULOS!$C$27)+E314)","v":"-"},"-"]
[null,{"$f":"IF(OR(B314>=CALCULOS!$F$18,B314=\"-\"),\"-\",B314+1)","v":"-"},{"$f":"IF(B315=\"-\",\"-\",CALCULOS!$F$14+B315)","v":"-"},{"$f":"IF(B315=\"-\",\"-\",D314*(1+CALCULOS!$C$27))","v":"-"},{"$f":"IF(B315=\"-\",\"-\",IF(B315=1,CALCULOS!$C$47,IF(MOD(B314,12)=0,E313*(1+CALCULOS!$C$28),E314))*IF(MOD(B315,12)=0,2,1))","v":"-"},{"$f":"IF(B315=\"-\",\"-\",F314*(1+CALCULOS!$C$27)+E315)","v":"-"},"-"]
[null,{"$f":"IF(OR(B315>=CALCULOS!$F$18,B315=\"-\"),\"-\",B315+1)","v":"-"},{"$f":"IF(B316=\"-\",\"-\",CALCULOS!$F$14+B316)","v":"-"},{"$f":"IF(B316=\"-\",\"-\",D315*(1+CALCULOS!$C$27))","v":"-"},{"$f":"IF(B316=\"-\",\"-\",IF(B316=1,CALCULOS!$C$47,IF(MOD(B315,12)=0,E314*(1+CALCULOS!$C$28),E315))*IF(MOD(B316,12)=0,2,1))","v":"-"},{"$f":"IF(B316=\"-\",\"-\",F315*(1+CALCULOS!$C$27)+E316)","v":"-"},"-"]
[null,{"$f":"IF(OR(B316>=CALCULOS!$F$18,B316=\"-\"),\"-\",B316+1)","v":"-"},{"$f":"IF(B317=\"-\",\"-\",CALCULOS!$F$14+B317)","v":"-"},{"$f":"IF(B317=\"-\",\"-\",D316*(1+CALCULOS!$C$27))","v":"-"},{"$f":"IF(B317=\"-\",\"-\",IF(B317=1,CALCULOS!$C$47,IF(MOD(B316,12)=0,E315*(1+CALCULOS!$C$28),E316))*IF(MOD(B317,12)=0,2,1))","v":"-"},{"$f":"IF(B317=\"-\",\"-\",F316*(1+CALCULOS!$C$27)+E317)","v":"-"},"-"]
[null,{"$f":"IF(OR(B317>=CALCULOS!$F$18,B317=\"-\"),\"-\",B317+1)","v":"-"},{"$f":"IF(B318=\"-\",\"-\",CALCULOS!$F$14+B318)","v":"-"},{"$f":"IF(B318=\"-\",\"-\",D317*(1+CALCULOS!$C$27))","v":"-"},{"$f":"IF(B318=\"-\",\"-\",IF(B318=1,CALCULOS!$C$47,IF(MOD(B317,12)=0,E316*(1+CALCULOS!$C$28),E317))*IF(MOD(B318,12)=0,2,1))","v":"-"},{"$f":"IF(B318=\"-\",\"-\",F317*(1+CALCULOS!$C$27)+E318)","v":"-"},"-"]
[null,{"$f":"IF(OR(B318>=CALCULOS!$F$18,B318=\"-\"),\"-\",B318+1)","v":"-"},{"$f":"IF(B319=\"-\",\"-\",CALCULOS!$F$14+B319)","v":"-"},{"$f":"IF(B319=\"-\",\"-\",D318*(1+CALCULOS!$C$27))","v":"-"},{"$f":"IF(B319=\"-\",\"-\",IF(B319=1,CALCULOS!$C$47,IF(MOD(B318,12)=0,E317*(1+CALCULOS!$C$28),E318))*IF(MOD(B319,12)=0,2,1))","v":"-"},{"$f":"IF(B319=\"-\",\"-\",F318*(1+CALCULOS!$C$27)+E319)","v":"-"},"-"]
[null,{"$f":"IF(OR(B319>=CALCULOS!$F$18,B319=\"-\"),\"-\",B319+1)","v":"-"},{"$f":"IF(B320=\"-\",\"-\",CALCULOS!$F$14+B320)","v":"-"},{"$f":"IF(B320=\"-\",\"-\",D319*(1+CALCULOS!$C$27))","v":"-"},{"$f":"IF(B320=\"-\",\"-\",IF(B320=1,CALCULOS!$C$47,IF(MOD(B319,12)=0,E318*(1+CALCULOS!$C$28),E319))*IF(MOD(B320,12)=0,2,1))","v":"-"},{"$f":"IF(B320=\"-\",\"-\",F319*(1+CALCULOS!$C$27)+E320)","v":"-"},"-"]
[null,{"$f":"IF(OR(B320>=CALCULOS!$F$18,B320=\"-\"),\"-\",B320+1)","v":"-"},{"$f":"IF(B321=\"-\",\"-\",CALCULOS!$F$14+B321)","v":"-"},{"$f":"IF(B321=\"-\",\"-\",D320*(1+CALCULOS!$C$27))","v":"-"},{"$f":"IF(B321=\"-\",\"-\",IF(B321=1,CALCULOS!$C$47,IF(MOD(B320,12)=0,E319*(1+CALCULOS!$C$28),E320))*IF(MOD(B321,12)=0,2,1))","v":"-"},{"$f":"IF(B321=\"-\",\"-\",F320*(1+CALCULOS!$C$27)+E321)","v":"-"},"-"]
[null,{"$f":"IF(OR(B321>=CALCULOS!$F$18,B321=\"-\"),\"-\",B321+1)","v":"-"},{"$f":"IF(B322=\"-\",\"-\",CALCULOS!$F$14+B322)","v":"-"},{"$f":"IF(B322=\"-\",\"-\",D321*(1+CALCULOS!$C$27))","v":"-"},{"$f":"IF(B322=\"-\",\"-\",IF(B322=1,CALCULOS!$C$47,IF(MOD(B321,12)=0,E320*(1+CALCULOS!$C$28),E321))*IF(MOD(B322,12)=0,2,1))","v":"-"},{"$f":"IF(B322=\"-\",\"-\",F321*(1+CALCULOS!$C$27)+E322)","v":"-"},"-"]
[null,{"$f":"IF(OR(B322>=CALCULOS!$F$18,B322=\"-\"),\"-\",B322+1)","v":"-"},{"$f":"IF(B323=\"-\",\"-\",CALCULOS!$F$14+B323)","v":"-"},{"$f":"IF(B323=\"-\",\"-\",D322*(1+CALCULOS!$C$27))","v":"-"},{"$f":"IF(B323=\"-\",\"-\",IF(B323=1,CALCULOS!$C$47,IF(MOD(B322,12)=0,E321*(1+CALCULOS!$C$28),E322))*IF(MOD(B323,12)=0,2,1))","v":"-"},{"$f":"IF(B323=\"-\",\"-\",F322*(1+CALCULOS!$C$27)+E323)","v":"-"},"-"]
[null,{"$f":"IF(OR(B323>=CALCULOS!$F$18,B323=\"-\"),\"-\",B323+1)","v":"-"},{"$f":"IF(B324=\"-\",\"-\",CALCULOS!$F$14+B324)","v":"-"},{"$f":"IF(B324=\"-\",\"-\",D323*(1+CALCULOS!$C$27))","v":"-"},{"$f":"IF(B324=\"-\",\"-\",IF(B324=1,CALCULOS!$C$47,IF(MOD(B323,12)=0,E322*(1+CALCULOS!$C$28),E323))*IF(MOD(B324,12)=0,2,1))","v":"-"},{"$f":"IF(B324=\"-\",\"-\",F323*(1+CALCULOS!$C$27)+E324)","v":"-"},"-"]
[null,{"$f":"IF(OR(B324>=CALCULOS!$F$18,B324=\"-\"),\"-\",B324+1)","v":"-"},{"$f":"IF(B325=\"-\",\"-\",CALCULOS!$F$14+B325)","v":"-"},{"$f":"IF(B325=\"-\",\"-\",D324*(1+CALCULOS!$C$27))","v":"-"},{"$f":"IF(B325=\"-\",\"-\",IF(B325=1,CALCULOS!$C$47,IF(MOD(B324,12)=0,E323*(1+CALCULOS!$C$28),E324))*IF(MOD(B325,12)=0,2,1))","v":"-"},{"$f":"IF(B325=\"-\",\"-\",F324*(1+CALCULOS!$C$27)+E325)","v":"-"},"-"]
[null,{"$f":"IF(OR(B325>=CALCULOS!$F$18,B325=\"-\"),\"-\",B325+1)","v":"-"},{"$f":"IF(B326=\"-\",\"-\",CALCULOS!$F$14+B326)","v":"-"},{"$f":"IF(B326=\"-\",\"-\",D325*(1+CALCULOS!$C$27))","v":"-"},{"$f":"IF(B326=\"-\",\"-\",IF(B326=1,CALCULOS!$C$47,IF(MOD(B325,12)=0,E324*(1+CALCULOS!$C$28),E325))*IF(MOD(B326,12)=0,2,1))","v":"-"},{"$f":"IF(B326=\"-\",\"-\",F325*(1+CALCULOS!$C$27)+E326)","v":"-"},"-"]
[null,{"$f":"IF(OR(B326>=CALCULOS!$F$18,B326=\"-\"),\"-\",B326+1)","v":"-"},{"$f":"IF(B327=\"-\",\"-\",CALCULOS!$F$14+B327)","v":"-"},{"$f":"IF(B327=\"-\",\"-\",D326*(1+CALCULOS!$C$27))","v":"-"},{"$f":"IF(B327=\"-\",\"-\",IF(B327=1,CALCULOS!$C$47,IF(MOD(B326,12)=0,E325*(1+CALCULOS!$C$28),E326))*IF(MOD(B327,12)=0,2,1))","v":"-"},{"$f":"IF(B327=\"-\",\"-\",F326*(1+CALCULOS!$C$27)+E327)","v":"-"},"-"]
[null,{"$f":"IF(OR(B327>=CALCULOS!$F$18,B327=\"-\"),\"-\",B327+1)","v":"-"},{"$f":"IF(B328=\"-\",\"-\",CALCULOS!$F$14+B328)","v":"-"},{"$f":"IF(B328=\"-\",\"-\",D327*(1+CALCULOS!$C$27))","v":"-"},{"$f":"IF(B328=\"-\",\"-\",IF(B328=1,CALCULOS!$C$47,IF(MOD(B327,12)=0,E326*(1+CALCULOS!$C$28),E327))*IF(MOD(B328,12)=0,2,1))","v":"-"},{"$f":"IF(B328=\"-\",\"-\",F327*(1+CALCULOS!$C$27)+E328)","v":"-"},"-"]
[null,{"$f":"IF(OR(B328>=CALCULOS!$F$18,B328=\"-\"),\"-\",B328+1)","v":"-"},{"$f":"IF(B329=\"-\",\"-\",CALCULOS!$F$14+B329)","v":"-"},{"$f":"IF(B329=\"-\",\"-\",D328*(1+CALCULOS!$C$27))","v":"-"},{"$f":"IF(B329=\"-\",\"-\",IF(B329=1,CALCULOS!$C$47,IF(MOD(B328,12)=0,E327*(1+CALCULOS!$C$28),E328))*IF(MOD(B329,12)=0,2,1))","v":"-"},{"$f":"IF(B329=\"-\",\"-\",F328*(1+CALCULOS!$C$27)+E329)","v":"-"},"-"]
[null,{"$f":"IF(OR(B329>=CALCULOS!$F$18,B329=\"-\"),\"-\",B329+1)","v":"-"},{"$f":"IF(B330=\"-\",\"-\",CALCULOS!$F$14+B330)","v":"-"},{"$f":"IF(B330=\"-\",\"-\",D329*(1+CALCULOS!$C$27))","v":"-"},{"$f":"IF(B330=\"-\",\"-\",IF(B330=1,CALCULOS!$C$47,IF(MOD(B329,12)=0,E328*(1+CALCULOS!$C$28),E329))*IF(MOD(B330,12)=0,2,1))","v":"-"},{"$f":"IF(B330=\"-\",\"-\",F329*(1+CALCULOS!$C$27)+E330)","v":"-"},"-"]
[null,{"$f":"IF(OR(B330>=CALCULOS!$F$18,B330=\"-\"),\"-\",B330+1)","v":"-"},{"$f":"IF(B331=\"-\",\"-\",CALCULOS!$F$14+B331)","v":"-"},{"$f":"IF(B331=\"-\",\"-\",D330*(1+CALCULOS!$C$27))","v":"-"},{"$f":"IF(B331=\"-\",\"-\",IF(B331=1,CALCULOS!$C$47,IF(MOD(B330,12)=0,E329*(1+CALCULOS!$C$28),E330))*IF(MOD(B331,12)=0,2,1))","v":"-"},{"$f":"IF(B331=\"-\",\"-\",F330*(1+CALCULOS!$C$27)+E331)","v":"-"},"-"]
[null,{"$f":"IF(OR(B331>=CALCULOS!$F$18,B331=\"-\"),\"-\",B331+1)","v":"-"},{"$f":"IF(B332=\"-\",\"-\",CALCULOS!$F$14+B332)","v":"-"},{"$f":"IF(B332=\"-\",\"-\",D331*(1+CALCULOS!$C$27))","v":"-"},{"$f":"IF(B332=\"-\",\"-\",IF(B332=1,CALCULOS!$C$47,IF(MOD(B331,12)=0,E330*(1+CALCULOS!$C$28),E331))*IF(MOD(B332,12)=0,2,1))","v":"-"},{"$f":"IF(B332=\"-\",\"-\",F331*(1+CALCULOS!$C$27)+E332)","v":"-"},"-"]
[null,{"$f":"IF(OR(B332>=CALCULOS!$F$18,B332=\"-\"),\"-\",B332+1)","v":"-"},{"$f":"IF(B333=\"-\",\"-\",CALCULOS!$F$14+B333)","v":"-"},{"$f":"IF(B333=\"-\",\"-\",D332*(1+CALCULOS!$C$27))","v":"-"},{"$f":"IF(B333=\"-\",\"-\",IF(B333=1,CALCULOS!$C$47,IF(MOD(B332,12)=0,E331*(1+CALCULOS!$C$28),E332))*IF(MOD(B333,12)=0,2,1))","v":"-"},{"$f":"IF(B333=\"-\",\"-\",F332*(1+CALCULOS!$C$27)+E333)","v":"-"},"-"]
[null,{"$f":"IF(OR(B333>=CALCULOS!$F$18,B333=\"-\"),\"-\",B333+1)","v":"-"},{"$f":"IF(B334=\"-\",\"-\",CALCULOS!$F$14+B334)","v":"-"},{"$f":"IF(B334=\"-\",\"-\",D333*(1+CALCULOS!$C$27))","v":"-"},{"$f":"IF(B334=\"-\",\"-\",IF(B334=1,CALCULOS!$C$47,IF(MOD(B333,12)=0,E332*(1+CALCULOS!$C$28),E333))*IF(MOD(B334,12)=0,2,1))","v":"-"},{"$f":"IF(B334=\"-\",\"-\",F333*(1+CALCULOS!$C$27)+E334)","v":"-"},"-"]
[null,{"$f":"IF(OR(B334>=CALCULOS!$F$18,B334=\"-\"),\"-\",B334+1)","v":"-"},{"$f":"IF(B335=\"-\",\"-\",CALCULOS!$F$14+B335)","v":"-"},{"$f":"IF(B335=\"-\",\"-\",D334*(1+CALCULOS!$C$27))","v":"-"},{"$f":"IF(B335=\"-\",\"-\",IF(B335=1,CALCULOS!$C$47,IF(MOD(B334,12)=0,E333*(1+CALCULOS!$C$28),E334))*IF(MOD(B335,12)=0,2,1))","v":"-"},{"$f":"IF(B335=\"-\",\"-\",F334*(1+CALCULOS!$C$27)+E335)","v":"-"},"-"]
[null,{"$f":"IF(OR(B335>=CALCULOS!$F$18,B335=\"-\"),\"-\",B335+1)","v":"-"},{"$f":"IF(B336=\"-\",\"-\",CALCULOS!$F$14+B336)","v":"-"},{"$f":"IF(B336=\"-\",\"-\",D335*(1+CALCULOS!$C$27))","v":"-"},{"$f":"IF(B336=\"-\",\"-\",IF(B336=1,CALCULOS!$C$47,IF(MOD(B335,12)=0,E334*(1+CALCULOS!$C$28),E335))*IF(MOD(B336,12)=0,2,1))","v":"-"},{"$f":"IF(B336=\"-\",\"-\",F335*(1+CALCULOS!$C$27)+E336)","v":"-"},"-"]
[null,{"$f":"IF(OR(B336>=CALCULOS!$F$18,B336=\"-\"),\"-\",B336+1)","v":"-"},{"$f":"IF(B337=\"-\",\"-\",CALCULOS!$F$14+B337)","v":"-"},{"$f":"IF(B337=\"-\",\"-\",D336*(1+CALCULOS!$C$27))","v":"-"},{"$f":"IF(B337=\"-\",\"-\",IF(B337=1,CALCULOS!$C$47,IF(MOD(B336,12)=0,E335*(1+CALCULOS!$C$28),E336))*IF(MOD(B337,12)=0,2,1))","v":"-"},{"$f":"IF(B337=\"-\",\"-\",F336*(1+CALCULOS!$C$27)+E337)","v":"-"},"-"]
[null,{"$f":"IF(OR(B337>=CALCULOS!$F$18,B337=\"-\"),\"-\",B337+1)","v":"-"},{"$f":"IF(B338=\"-\",\"-\",CALCULOS!$F$14+B338)","v":"-"},{"$f":"IF(B338=\"-\",\"-\",D337*(1+CALCULOS!$C$27))","v":"-"},{"$f":"IF(B338=\"-\",\"-\",IF(B338=1,CALCULOS!$C$47,IF(MOD(B337,12)=0,E336*(1+CALCULOS!$C$28),E337))*IF(MOD(B338,12)=0,2,1))","v":"-"},{"$f":"IF(B338=\"-\",\"-\",F337*(1+CALCULOS!$C$27)+E338)","v":"-"},"-"]
[null,{"$f":"IF(OR(B338>=CALCULOS!$F$18,B338=\"-\"),\"-\",B338+1)","v":"-"},{"$f":"IF(B339=\"-\",\"-\",CALCULOS!$F$14+B339)","v":"-"},{"$f":"IF(B339=\"-\",\"-\",D338*(1+CALCULOS!$C$27))","v":"-"},{"$f":"IF(B339=\"-\",\"-\",IF(B339=1,CALCULOS!$C$47,IF(MOD(B338,12)=0,E337*(1+CALCULOS!$C$28),E338))*IF(MOD(B339,12)=0,2,1))","v":"-"},{"$f":"IF(B339=\"-\",\"-\",F338*(1+CALCULOS!$C$27)+E339)","v":"-"},"-"]
[null,{"$f":"IF(OR(B339>=CALCULOS!$F$18,B339=\"-\"),\"-\",B339+1)","v":"-"},{"$f":"IF(B340=\"-\",\"-\",CALCULOS!$F$14+B340)","v":"-"},{"$f":"IF(B340=\"-\",\"-\",D339*(1+CALCULOS!$C$27))","v":"-"},{"$f":"IF(B340=\"-\",\"-\",IF(B340=1,CALCULOS!$C$47,IF(MOD(B339,12)=0,E338*(1+CALCULOS!$C$28),E339))*IF(MOD(B340,12)=0,2,1))","v":"-"},{"$f":"IF(B340=\"-\",\"-\",F339*(1+CALCULOS!$C$27)+E340)","v":"-"},"-"]
[null,{"$f":"IF(OR(B340>=CALCULOS!$F$18,B340=\"-\"),\"-\",B340+1)","v":"-"},{"$f":"IF(B341=\"-\",\"-\",CALCULOS!$F$14+B341)","v":"-"},{"$f":"IF(B341=\"-\",\"-\",D340*(1+CALCULOS!$C$27))","v":"-"},{"$f":"IF(B341=\"-\",\"-\",IF(B341=1,CALCULOS!$C$47,IF(MOD(B340,12)=0,E339*(1+CALCULOS!$C$28),E340))*IF(MOD(B341,12)=0,2,1))","v":"-"},{"$f":"IF(B341=\"-\",\"-\",F340*(1+CALCULOS!$C$27)+E341)","v":"-"},"-"]
[null,{"$f":"IF(OR(B341>=CALCULOS!$F$18,B341=\"-\"),\"-\",B341+1)","v":"-"},{"$f":"IF(B342=\"-\",\"-\",CALCULOS!$F$14+B342)","v":"-"},{"$f":"IF(B342=\"-\",\"-\",D341*(1+CALCULOS!$C$27))","v":"-"},{"$f":"IF(B342=\"-\",\"-\",IF(B342=1,CALCULOS!$C$47,IF(MOD(B341,12)=0,E340*(1+CALCULOS!$C$28),E341))*IF(MOD(B342,12)=0,2,1))","v":"-"},{"$f":"IF(B342=\"-\",\"-\",F341*(1+CALCULOS!$C$27)+E342)","v":"-"},"-"]
[null,{"$f":"IF(OR(B342>=CALCULOS!$F$18,B342=\"-\"),\"-\",B342+1)","v":"-"},{"$f":"IF(B343=\"-\",\"-\",CALCULOS!$F$14+B343)","v":"-"},{"$f":"IF(B343=\"-\",\"-\",D342*(1+CALCULOS!$C$27))","v":"-"},{"$f":"IF(B343=\"-\",\"-\",IF(B343=1,CALCULOS!$C$47,IF(MOD(B342,12)=0,E341*(1+CALCULOS!$C$28),E342))*IF(MOD(B343,12)=0,2,1))","v":"-"},{"$f":"IF(B343=\"-\",\"-\",F342*(1+CALCULOS!$C$27)+E343)","v":"-"},"-"]
[null,{"$f":"IF(OR(B343>=CALCULOS!$F$18,B343=\"-\"),\"-\",B343+1)","v":"-"},{"$f":"IF(B344=\"-\",\"-\",CALCULOS!$F$14+B344)","v":"-"},{"$f":"IF(B344=\"-\",\"-\",D343*(1+CALCULOS!$C$27))","v":"-"},{"$f":"IF(B344=\"-\",\"-\",IF(B344=1,CALCULOS!$C$47,IF(MOD(B343,12)=0,E342*(1+CALCULOS!$C$28),E343))*IF(MOD(B344,12)=0,2,1))","v":"-"},{"$f":"IF(B344=\"-\",\"-\",F343*(1+CALCULOS!$C$27)+E344)","v":"-"},"-"]
[null,{"$f":"IF(OR(B344>=CALCULOS!$F$18,B344=\"-\"),\"-\",B344+1)","v":"-"},{"$f":"IF(B345=\"-\",\"-\",CALCULOS!$F$14+B345)","v":"-"},{"$f":"IF(B345=\"-\",\"-\",D344*(1+CALCULOS!$C$27))","v":"-"},{"$f":"IF(B345=\"-\",\"-\",IF(B345=1,CALCULOS!$C$47,IF(MOD(B344,12)=0,E343*(1+CALCULOS!$C$28),E344))*IF(MOD(B345,12)=0,2,1))","v":"-"},{"$f":"IF(B345=\"-\",\"-\",F344*(1+CALCULOS!$C$27)+E345)","v":"-"},{"$f":"IF(B345=\"-\",\"-\",SUM(D345,F345))","v":"-"}]
[null,{"$f":"IF(OR(B345>=CALCULOS!$F$18,B345=\"-\"),\"-\",B345+1)","v":"-"},{"$f":"IF(B346=\"-\",\"-\",CALCULOS!$F$14+B346)","v":"-"},{"$f":"IF(B346=\"-\",\"-\",D345*(1+CALCULOS!$C$27))","v":"-"},{"$f":"IF(B346=\"-\",\"-\",IF(B346=1,CALCULOS!$C$47,IF(MOD(B345,12)=0,E344*(1+CALCULOS!$C$28),E345))*IF(MOD(B346,12)=0,2,1))","v":"-"},{"$f":"IF(B346=\"-\",\"-\",F345*(1+CALCULOS!$C$27)+E346)","v":"-"},"-"]
[null,{"$f":"IF(OR(B346>=CALCULOS!$F$18,B346=\"-\"),\"-\",B346+1)","v":"-"},{"$f":"IF(B347=\"-\",\"-\",CALCULOS!$F$14+B347)","v":"-"},{"$f":"IF(B347=\"-\",\"-\",D346*(1+CALCULOS!$C$27))","v":"-"},{"$f":"IF(B347=\"-\",\"-\",IF(B347=1,CALCULOS!$C$47,IF(MOD(B346,12)=0,E345*(1+CALCULOS!$C$28),E346))*IF(MOD(B347,12)=0,2,1))","v":"-"},{"$f":"IF(B347=\"-\",\"-\",F346*(1+CALCULOS!$C$27)+E347)","v":"-"},"-"]
[null,{"$f":"IF(OR(B347>=CALCULOS!$F$18,B347=\"-\"),\"-\",B347+1)","v":"-"},{"$f":"IF(B348=\"-\",\"-\",CALCULOS!$F$14+B348)","v":"-"},{"$f":"IF(B348=\"-\",\"-\",D347*(1+CALCULOS!$C$27))","v":"-"},{"$f":"IF(B348=\"-\",\"-\",IF(B348=1,CALCULOS!$C$47,IF(MOD(B347,12)=0,E346*(1+CALCULOS!$C$28),E347))*IF(MOD(B348,12)=0,2,1))","v":"-"},{"$f":"IF(B348=\"-\",\"-\",F347*(1+CALCULOS!$C$27)+E348)","v":"-"},"-"]
[null,{"$f":"IF(OR(B348>=CALCULOS!$F$18,B348=\"-\"),\"-\",B348+1)","v":"-"},{"$f":"IF(B349=\"-\",\"-\",CALCULOS!$F$14+B349)","v":"-"},{"$f":"IF(B349=\"-\",\"-\",D348*(1+CALCULOS!$C$27))","v":"-"},{"$f":"IF(B349=\"-\",\"-\",IF(B349=1,CALCULOS!$C$47,IF(MOD(B348,12)=0,E347*(1+CALCULOS!$C$28),E348))*IF(MOD(B349,12)=0,2,1))","v":"-"},{"$f":"IF(B349=\"-\",\"-\",F348*(1+CALCULOS!$C$27)+E349)","v":"-"},"-"]
[null,{"$f":"IF(OR(B349>=CALCULOS!$F$18,B349=\"-\"),\"-\",B349+1)","v":"-"},{"$f":"IF(B350=\"-\",\"-\",CALCULOS!$F$14+B350)","v":"-"},{"$f":"IF(B350=\"-\",\"-\",D349*(1+CALCULOS!$C$27))","v":"-"},{"$f":"IF(B350=\"-\",\"-\",IF(B350=1,CALCULOS!$C$47,IF(MOD(B349,12)=0,E348*(1+CALCULOS!$C$28),E349))*IF(MOD(B350,12)=0,2,1))","v":"-"},{"$f":"IF(B350=\"-\",\"-\",F349*(1+CALCULOS!$C$27)+E350)","v":"-"},"-"]
[null,{"$f":"IF(OR(B350>=CALCULOS!$F$18,B350=\"-\"),\"-\",B350+1)","v":"-"},{"$f":"IF(B351=\"-\",\"-\",CALCULOS!$F$14+B351)","v":"-"},{"$f":"IF(B351=\"-\",\"-\",D350*(1+CALCULOS!$C$27))","v":"-"},{"$f":"IF(B351=\"-\",\"-\",IF(B351=1,CALCULOS!$C$47,IF(MOD(B350,12)=0,E349*(1+CALCULOS!$C$28),E350))*IF(MOD(B351,12)=0,2,1))","v":"-"},{"$f":"IF(B351=\"-\",\"-\",F350*(1+CALCULOS!$C$27)+E351)","v":"-"},"-"]
[null,{"$f":"IF(OR(B351>=CALCULOS!$F$18,B351=\"-\"),\"-\",B351+1)","v":"-"},{"$f":"IF(B352=\"-\",\"-\",CALCULOS!$F$14+B352)","v":"-"},{"$f":"IF(B352=\"-\",\"-\",D351*(1+CALCULOS!$C$27))","v":"-"},{"$f":"IF(B352=\"-\",\"-\",IF(B352=1,CALCULOS!$C$47,IF(MOD(B351,12)=0,E350*(1+CALCULOS!$C$28),E351))*IF(MOD(B352,12)=0,2,1))","v":"-"},{"$f":"IF(B352=\"-\",\"-\",F351*(1+CALCULOS!$C$27)+E352)","v":"-"},"-"]
[null,{"$f":"IF(OR(B352>=CALCULOS!$F$18,B352=\"-\"),\"-\",B352+1)","v":"-"},{"$f":"IF(B353=\"-\",\"-\",CALCULOS!$F$14+B353)","v":"-"},{"$f":"IF(B353=\"-\",\"-\",D352*(1+CALCULOS!$C$27))","v":"-"},{"$f":"IF(B353=\"-\",\"-\",IF(B353=1,CALCULOS!$C$47,IF(MOD(B352,12)=0,E351*(1+CALCULOS!$C$28),E352))*IF(MOD(B353,12)=0,2,1))","v":"-"},{"$f":"IF(B353=\"-\",\"-\",F352*(1+CALCULOS!$C$27)+E353)","v":"-"},"-"]
[null,{"$f":"IF(OR(B353>=CALCULOS!$F$18,B353=\"-\"),\"-\",B353+1)","v":"-"},{"$f":"IF(B354=\"-\",\"-\",CALCULOS!$F$14+B354)","v":"-"},{"$f":"IF(B354=\"-\",\"-\",D353*(1+CALCULOS!$C$27))","v":"-"},{"$f":"IF(B354=\"-\",\"-\",IF(B354=1,CALCULOS!$C$47,IF(MOD(B353,12)=0,E352*(1+CALCULOS!$C$28),E353))*IF(MOD(B354,12)=0,2,1))","v":"-"},{"$f":"IF(B354=\"-\",\"-\",F353*(1+CALCULOS!$C$27)+E354)","v":"-"},"-"]
[null,{"$f":"IF(OR(B354>=CALCULOS!$F$18,B354=\"-\"),\"-\",B354+1)","v":"-"},{"$f":"IF(B355=\"-\",\"-\",CALCULOS!$F$14+B355)","v":"-"},{"$f":"IF(B355=\"-\",\"-\",D354*(1+CALCULOS!$C$27))","v":"-"},{"$f":"IF(B355=\"-\",\"-\",IF(B355=1,CALCULOS!$C$47,IF(MOD(B354,12)=0,E353*(1+CALCULOS!$C$28),E354))*IF(MOD(B355,12)=0,2,1))","v":"-"},{"$f":"IF(B355=\"-\",\"-\",F354*(1+CALCULOS!$C$27)+E355)","v":"-"},"-"]
[null,{"$f":"IF(OR(B355>=CALCULOS!$F$18,B355=\"-\"),\"-\",B355+1)","v":"-"},{"$f":"IF(B356=\"-\",\"-\",CALCULOS!$F$14+B356)","v":"-"},{"$f":"IF(B356=\"-\",\"-\",D355*(1+CALCULOS!$C$27))","v":"-"},{"$f":"IF(B356=\"-\",\"-\",IF(B356=1,CALCULOS!$C$47,IF(MOD(B355,12)=0,E354*(1+CALCULOS!$C$28),E355))*IF(MOD(B356,12)=0,2,1))","v":"-"},{"$f":"IF(B356=\"-\",\"-\",F355*(1+CALCULOS!$C$27)+E356)","v":"-"},"-"]
[null,{"$f":"IF(OR(B356>=CALCULOS!$F$18,B356=\"-\"),\"-\",B356+1)","v":"-"},{"$f":"IF(B357=\"-\",\"-\",CALCULOS!$F$14+B357)","v":"-"},{"$f":"IF(B357=\"-\",\"-\",D356*(1+CALCULOS!$C$27))","v":"-"},{"$f":"IF(B357=\"-\",\"-\",IF(B357=1,CALCULOS!$C$47,IF(MOD(B356,12)=0,E355*(1+CALCULOS!$C$28),E356))*IF(MOD(B357,12)=0,2,1))","v":"-"},{"$f":"IF(B357=\"-\",\"-\",F356*(1+CALCULOS!$C$27)+E357)","v":"-"},"-"]
[null,{"$f":"IF(OR(B357>=CALCULOS!$F$18,B357=\"-\"),\"-\",B357+1)","v":"-"},{"$f":"IF(B358=\"-\",\"-\",CALCULOS!$F$14+B358)","v":"-"},{"$f":"IF(B358=\"-\",\"-\",D357*(1+CALCULOS!$C$27))","v":"-"},{"$f":"IF(B358=\"-\",\"-\",IF(B358=1,CALCULOS!$C$47,IF(MOD(B357,12)=0,E356*(1+CALCULOS!$C$28),E357))*IF(MOD(B358,12)=0,2,1))","v":"-"},{"$f":"IF(B358=\"-\",\"-\",F357*(1+CALCULOS!$C$27)+E358)","v":"-"},"-"]
[null,{"$f":"IF(OR(B358>=CALCULOS!$F$18,B358=\"-\"),\"-\",B358+1)","v":"-"},{"$f":"IF(B359=\"-\",\"-\",CALCULOS!$F$14+B359)","v":"-"},{"$f":"IF(B359=\"-\",\"-\",D358*(1+CALCULOS!$C$27))","v":"-"},{"$f":"IF(B359=\"-\",\"-\",IF(B359=1,CALCULOS!$C$47,IF(MOD(B358,12)=0,E357*(1+CALCULOS!$C$28),E358))*IF(MOD(B359,12)=0,2,1))","v":"-"},{"$f":"IF(B359=\"-\",\"-\",F358*(1+CALCULOS!$C$27)+E359)","v":"-"},"-"]
[null,{"$f":"IF(OR(B359>=CALCULOS!$F$18,B359=\"-\"),\"-\",B359+1)","v":"-"},{"$f":"IF(B360=\"-\",\"-\",CALCULOS!$F$14+B360)","v":"-"},{"$f":"IF(B360=\"-\",\"-\",D359*(1+CALCULOS!$C$27))","v":"-"},{"$f":"IF(B360=\"-\",\"-\",IF(B360=1,CALCULOS!$C$47,IF(MOD(B359,12)=0,E358*(1+CALCULOS!$C$28),E359))*IF(MOD(B360,12)=0,2,1))","v":"-"},{"$f":"IF(B360=\"-\",\"-\",F359*(1+CALCULOS!$C$27)+E360)","v":"-"},"-"]
[null,{"$f":"IF(OR(B360>=CALCULOS!$F$18,B360=\"-\"),\"-\",B360+1)","v":"-"},{"$f":"IF(B361=\"-\",\"-\",CALCULOS!$F$14+B361)","v":"-"},{"$f":"IF(B361=\"-\",\"-\",D360*(1+CALCULOS!$C$27))","v":"-"},{"$f":"IF(B361=\"-\",\"-\",IF(B361=1,CALCULOS!$C$47,IF(MOD(B360,12)=0,E359*(1+CALCULOS!$C$28),E360))*IF(MOD(B361,12)=0,2,1))","v":"-"},{"$f":"IF(B361=\"-\",\"-\",F360*(1+CALCULOS!$C$27)+E361)","v":"-"},"-"]
[null,{"$f":"IF(OR(B361>=CALCULOS!$F$18,B361=\"-\"),\"-\",B361+1)","v":"-"},{"$f":"IF(B362=\"-\",\"-\",CALCULOS!$F$14+B362)","v":"-"},{"$f":"IF(B362=\"-\",\"-\",D361*(1+CALCULOS!$C$27))","v":"-"},{"$f":"IF(B362=\"-\",\"-\",IF(B362=1,CALCULOS!$C$47,IF(MOD(B361,12)=0,E360*(1+CALCULOS!$C$28),E361))*IF(MOD(B362,12)=0,2,1))","v":"-"},{"$f":"IF(B362=\"-\",\"-\",F361*(1+CALCULOS!$C$27)+E362)","v":"-"},"-"]
[null,{"$f":"IF(OR(B362>=CALCULOS!$F$18,B362=\"-\"),\"-\",B362+1)","v":"-"},{"$f":"IF(B363=\"-\",\"-\",CALCULOS!$F$14+B363)","v":"-"},{"$f":"IF(B363=\"-\",\"-\",D362*(1+CALCULOS!$C$27))","v":"-"},{"$f":"IF(B363=\"-\",\"-\",IF(B363=1,CALCULOS!$C$47,IF(MOD(B362,12)=0,E361*(1+CALCULOS!$C$28),E362))*IF(MOD(B363,12)=0,2,1))","v":"-"},{"$f":"IF(B363=\"-\",\"-\",F362*(1+CALCULOS!$C$27)+E363)","v":"-"},"-"]
[null,{"$f":"IF(OR(B363>=CALCULOS!$F$18,B363=\"-\"),\"-\",B363+1)","v":"-"},{"$f":"IF(B364=\"-\",\"-\",CALCULOS!$F$14+B364)","v":"-"},{"$f":"IF(B364=\"-\",\"-\",D363*(1+CALCULOS!$C$27))","v":"-"},{"$f":"IF(B364=\"-\",\"-\",IF(B364=1,CALCULOS!$C$47,IF(MOD(B363,12)=0,E362*(1+CALCULOS!$C$28),E363))*IF(MOD(B364,12)=0,2,1))","v":"-"},{"$f":"IF(B364=\"-\",\"-\",F363*(1+CALCULOS!$C$27)+E364)","v":"-"},"-"]
[null,{"$f":"IF(OR(B364>=CALCULOS!$F$18,B364=\"-\"),\"-\",B364+1)","v":"-"},{"$f":"IF(B365=\"-\",\"-\",CALCULOS!$F$14+B365)","v":"-"},{"$f":"IF(B365=\"-\",\"-\",D364*(1+CALCULOS!$C$27))","v":"-"},{"$f":"IF(B365=\"-\",\"-\",IF(B365=1,CALCULOS!$C$47,IF(MOD(B364,12)=0,E363*(1+CALCULOS!$C$28),E364))*IF(MOD(B365,12)=0,2,1))","v":"-"},{"$f":"IF(B365=\"-\",\"-\",F364*(1+CALCULOS!$C$27)+E365)","v":"-"},"-"]
[null,{"$f":"IF(OR(B365>=CALCULOS!$F$18,B365=\"-\"),\"-\",B365+1)","v":"-"},{"$f":"IF(B366=\"-\",\"-\",CALCULOS!$F$14+B366)","v":"-"},{"$f":"IF(B366=\"-\",\"-\",D365*(1+CALCULOS!$C$27))","v":"-"},{"$f":"IF(B366=\"-\",\"-\",IF(B366=1,CALCULOS!$C$47,IF(MOD(B365,12)=0,E364*(1+CALCULOS!$C$28),E365))*IF(MOD(B366,12)=0,2,1))","v":"-"},{"$f":"IF(B366=\"-\",\"-\",F365*(1+CALCULOS!$C$27)+E366)","v":"-"},"-"]
[null,{"$f":"IF(OR(B366>=CALCULOS!$F$18,B366=\"-\"),\"-\",B366+1)","v":"-"},{"$f":"IF(B367=\"-\",\"-\",CALCULOS!$F$14+B367)","v":"-"},{"$f":"IF(B367=\"-\",\"-\",D366*(1+CALCULOS!$C$27))","v":"-"},{"$f":"IF(B367=\"-\",\"-\",IF(B367=1,CALCULOS!$C$47,IF(MOD(B366,12)=0,E365*(1+CALCULOS!$C$28),E366))*IF(MOD(B367,12)=0,2,1))","v":"-"},{"$f":"IF(B367=\"-\",\"-\",F366*(1+CALCULOS!$C$27)+E367)","v":"-"},"-"]
[null,{"$f":"IF(OR(B367>=CALCULOS!$F$18,B367=\"-\"),\"-\",B367+1)","v":"-"},{"$f":"IF(B368=\"-\",\"-\",CALCULOS!$F$14+B368)","v":"-"},{"$f":"IF(B368=\"-\",\"-\",D367*(1+CALCULOS!$C$27))","v":"-"},{"$f":"IF(B368=\"-\",\"-\",IF(B368=1,CALCULOS!$C$47,IF(MOD(B367,12)=0,E366*(1+CALCULOS!$C$28),E367))*IF(MOD(B368,12)=0,2,1))","v":"-"},{"$f":"IF(B368=\"-\",\"-\",F367*(1+CALCULOS!$C$27)+E368)","v":"-"},"-"]
[null,{"$f":"IF(OR(B368>=CALCULOS!$F$18,B368=\"-\"),\"-\",B368+1)","v":"-"},{"$f":"IF(B369=\"-\",\"-\",CALCULOS!$F$14+B369)","v":"-"},{"$f":"IF(B369=\"-\",\"-\",D368*(1+CALCULOS!$C$27))","v":"-"},{"$f":"IF(B369=\"-\",\"-\",IF(B369=1,CALCULOS!$C$47,IF(MOD(B368,12)=0,E367*(1+CALCULOS!$C$28),E368))*IF(MOD(B369,12)=0,2,1))","v":"-"},{"$f":"IF(B369=\"-\",\"-\",F368*(1+CALCULOS!$C$27)+E369)","v":"-"},"-"]
[null,{"$f":"IF(OR(B369>=CALCULOS!$F$18,B369=\"-\"),\"-\",B369+1)","v":"-"},{"$f":"IF(B370=\"-\",\"-\",CALCULOS!$F$14+B370)","v":"-"},{"$f":"IF(B370=\"-\",\"-\",D369*(1+CALCULOS!$C$27))","v":"-"},{"$f":"IF(B370=\"-\",\"-\",IF(B370=1,CALCULOS!$C$47,IF(MOD(B369,12)=0,E368*(1+CALCULOS!$C$28),E369))*IF(MOD(B370,12)=0,2,1))","v":"-"},{"$f":"IF(B370=\"-\",\"-\",F369*(1+CALCULOS!$C$27)+E370)","v":"-"},"-"]
[null,{"$f":"IF(OR(B370>=CALCULOS!$F$18,B370=\"-\"),\"-\",B370+1)","v":"-"},{"$f":"IF(B371=\"-\",\"-\",CALCULOS!$F$14+B371)","v":"-"},{"$f":"IF(B371=\"-\",\"-\",D370*(1+CALCULOS!$C$27))","v":"-"},{"$f":"IF(B371=\"-\",\"-\",IF(B371=1,CALCULOS!$C$47,IF(MOD(B370,12)=0,E369*(1+CALCULOS!$C$28),E370))*IF(MOD(B371,12)=0,2,1))","v":"-"},{"$f":"IF(B371=\"-\",\"-\",F370*(1+CALCULOS!$C$27)+E371)","v":"-"},"-"]
[null,{"$f":"IF(OR(B371>=CALCULOS!$F$18,B371=\"-\"),\"-\",B371+1)","v":"-"},{"$f":"IF(B372=\"-\",\"-\",CALCULOS!$F$14+B372)","v":"-"},{"$f":"IF(B372=\"-\",\"-\",D371*(1+CALCULOS!$C$27))","v":"-"},{"$f":"IF(B372=\"-\",\"-\",IF(B372=1,CALCULOS!$C$47,IF(MOD(B371,12)=0,E370*(1+CALCULOS!$C$28),E371))*IF(MOD(B372,12)=0,2,1))","v":"-"},{"$f":"IF(B372=\"-\",\"-\",F371*(1+CALCULOS!$C$27)+E372)","v":"-"},"-"]
[null,{"$f":"IF(OR(B372>=CALCULOS!$F$18,B372=\"-\"),\"-\",B372+1)","v":"-"},{"$f":"IF(B373=\"-\",\"-\",CALCULOS!$F$14+B373)","v":"-"},{"$f":"IF(B373=\"-\",\"-\",D372*(1+CALCULOS!$C$27))","v":"-"},{"$f":"IF(B373=\"-\",\"-\",IF(B373=1,CALCULOS!$C$47,IF(MOD(B372,12)=0,E371*(1+CALCULOS!$C$28),E372))*IF(MOD(B373,12)=0,2,1))","v":"-"},{"$f":"IF(B373=\"-\",\"-\",F372*(1+CALCULOS!$C$27)+E373)","v":"-"},"-"]
[null,{"$f":"IF(OR(B373>=CALCULOS!$F$18,B373=\"-\"),\"-\",B373+1)","v":"-"},{"$f":"IF(B374=\"-\",\"-\",CALCULOS!$F$14+B374)","v":"-"},{"$f":"IF(B374=\"-\",\"-\",D373*(1+CALCULOS!$C$27))","v":"-"},{"$f":"IF(B374=\"-\",\"-\",IF(B374=1,CALCULOS!$C$47,IF(MOD(B373,12)=0,E372*(1+CALCULOS!$C$28),E373))*IF(MOD(B374,12)=0,2,1))","v":"-"},{"$f":"IF(B374=\"-\",\"-\",F373*(1+CALCULOS!$C$27)+E374)","v":"-"},"-"]
[null,{"$f":"IF(OR(B374>=CALCULOS!$F$18,B374=\"-\"),\"-\",B374+1)","v":"-"},{"$f":"IF(B375=\"-\",\"-\",CALCULOS!$F$14+B375)","v":"-"},{"$f":"IF(B375=\"-\",\"-\",D374*(1+CALCULOS!$C$27))","v":"-"},{"$f":"IF(B375=\"-\",\"-\",IF(B375=1,CALCULOS!$C$47,IF(MOD(B374,12)=0,E373*(1+CALCULOS!$C$28),E374))*IF(MOD(B375,12)=0,2,1))","v":"-"},{"$f":"IF(B375=\"-\",\"-\",F374*(1+CALCULOS!$C$27)+E375)","v":"-"},"-"]
[null,{"$f":"IF(OR(B375>=CALCULOS!$F$18,B375=\"-\"),\"-\",B375+1)","v":"-"},{"$f":"IF(B376=\"-\",\"-\",CALCULOS!$F$14+B376)","v":"-"},{"$f":"IF(B376=\"-\",\"-\",D375*(1+CALCULOS!$C$27))","v":"-"},{"$f":"IF(B376=\"-\",\"-\",IF(B376=1,CALCULOS!$C$47,IF(MOD(B375,12)=0,E374*(1+CALCULOS!$C$28),E375))*IF(MOD(B376,12)=0,2,1))","v":"-"},{"$f":"IF(B376=\"-\",\"-\",F375*(1+CALCULOS!$C$27)+E376)","v":"-"},"-"]
[null,{"$f":"IF(OR(B376>=CALCULOS!$F$18,B376=\"-\"),\"-\",B376+1)","v":"-"},{"$f":"IF(B377=\"-\",\"-\",CALCULOS!$F$14+B377)","v":"-"},{"$f":"IF(B377=\"-\",\"-\",D376*(1+CALCULOS!$C$27))","v":"-"},{"$f":"IF(B377=\"-\",\"-\",IF(B377=1,CALCULOS!$C$47,IF(MOD(B376,12)=0,E375*(1+CALCULOS!$C$28),E376))*IF(MOD(B377,12)=0,2,1))","v":"-"},{"$f":"IF(B377=\"-\",\"-\",F376*(1+CALCULOS!$C$27)+E377)","v":"-"},"-"]
[null,{"$f":"IF(OR(B377>=CALCULOS!$F$18,B377=\"-\"),\"-\",B377+1)","v":"-"},{"$f":"IF(B378=\"-\",\"-\",CALCULOS!$F$14+B378)","v":"-"},{"$f":"IF(B378=\"-\",\"-\",D377*(1+CALCULOS!$C$27))","v":"-"},{"$f":"IF(B378=\"-\",\"-\",IF(B378=1,CALCULOS!$C$47,IF(MOD(B377,12)=0,E376*(1+CALCULOS!$C$28),E377))*IF(MOD(B378,12)=0,2,1))","v":"-"},{"$f":"IF(B378=\"-\",\"-\",F377*(1+CALCULOS!$C$27)+E378)","v":"-"},"-"]
[null,{"$f":"IF(OR(B378>=CALCULOS!$F$18,B378=\"-\"),\"-\",B378+1)","v":"-"},{"$f":"IF(B379=\"-\",\"-\",CALCULOS!$F$14+B379)","v":"-"},{"$f":"IF(B379=\"-\",\"-\",D378*(1+CALCULOS!$C$27))","v":"-"},{"$f":"IF(B379=\"-\",\"-\",IF(B379=1,CALCULOS!$C$47,IF(MOD(B378,12)=0,E377*(1+CALCULOS!$C$28),E378))*IF(MOD(B379,12)=0,2,1))","v":"-"},{"$f":"IF(B379=\"-\",\"-\",F378*(1+CALCULOS!$C$27)+E379)","v":"-"},"-"]
[null,{"$f":"IF(OR(B379>=CALCULOS!$F$18,B379=\"-\"),\"-\",B379+1)","v":"-"},{"$f":"IF(B380=\"-\",\"-\",CALCULOS!$F$14+B380)","v":"-"},{"$f":"IF(B380=\"-\",\"-\",D379*(1+CALCULOS!$C$27))","v":"-"},{"$f":"IF(B380=\"-\",\"-\",IF(B380=1,CALCULOS!$C$47,IF(MOD(B379,12)=0,E378*(1+CALCULOS!$C$28),E379))*IF(MOD(B380,12)=0,2,1))","v":"-"},{"$f":"IF(B380=\"-\",\"-\",F379*(1+CALCULOS!$C$27)+E380)","v":"-"},"-"]
[null,{"$f":"IF(OR(B380>=CALCULOS!$F$18,B380=\"-\"),\"-\",B380+1)","v":"-"},{"$f":"IF(B381=\"-\",\"-\",CALCULOS!$F$14+B381)","v":"-"},{"$f":"IF(B381=\"-\",\"-\",D380*(1+CALCULOS!$C$27))","v":"-"},{"$f":"IF(B381=\"-\",\"-\",IF(B381=1,CALCULOS!$C$47,IF(MOD(B380,12)=0,E379*(1+CALCULOS!$C$28),E380))*IF(MOD(B381,12)=0,2,1))","v":"-"},{"$f":"IF(B381=\"-\",\"-\",F380*(1+CALCULOS!$C$27)+E381)","v":"-"},"-"]
[null,{"$f":"IF(OR(B381>=CALCULOS!$F$18,B381=\"-\"),\"-\",B381+1)","v":"-"},{"$f":"IF(B382=\"-\",\"-\",CALCULOS!$F$14+B382)","v":"-"},{"$f":"IF(B382=\"-\",\"-\",D381*(1+CALCULOS!$C$27))","v":"-"},{"$f":"IF(B382=\"-\",\"-\",IF(B382=1,CALCULOS!$C$47,IF(MOD(B381,12)=0,E380*(1+CALCULOS!$C$28),E381))*IF(MOD(B382,12)=0,2,1))","v":"-"},{"$f":"IF(B382=\"-\",\"-\",F381*(1+CALCULOS!$C$27)+E382)","v":"-"},"-"]
[null,{"$f":"IF(OR(B382>=CALCULOS!$F$18,B382=\"-\"),\"-\",B382+1)","v":"-"},{"$f":"IF(B383=\"-\",\"-\",CALCULOS!$F$14+B383)","v":"-"},{"$f":"IF(B383=\"-\",\"-\",D382*(1+CALCULOS!$C$27))","v":"-"},{"$f":"IF(B383=\"-\",\"-\",IF(B383=1,CALCULOS!$C$47,IF(MOD(B382,12)=0,E381*(1+CALCULOS!$C$28),E382))*IF(MOD(B383,12)=0,2,1))","v":"-"},{"$f":"IF(B383=\"-\",\"-\",F382*(1+CALCULOS!$C$27)+E383)","v":"-"},"-"]
[null,{"$f":"IF(OR(B383>=CALCULOS!$F$18,B383=\"-\"),\"-\",B383+1)","v":"-"},{"$f":"IF(B384=\"-\",\"-\",CALCULOS!$F$14+B384)","v":"-"},{"$f":"IF(B384=\"-\",\"-\",D383*(1+CALCULOS!$C$27))","v":"-"},{"$f":"IF(B384=\"-\",\"-\",IF(B384=1,CALCULOS!$C$47,IF(MOD(B383,12)=0,E382*(1+CALCULOS!$C$28),E383))*IF(MOD(B384,12)=0,2,1))","v":"-"},{"$f":"IF(B384=\"-\",\"-\",F383*(1+CALCULOS!$C$27)+E384)","v":"-"},"-"]
[null,{"$f":"IF(OR(B384>=CALCULOS!$F$18,B384=\"-\"),\"-\",B384+1)","v":"-"},{"$f":"IF(B385=\"-\",\"-\",CALCULOS!$F$14+B385)","v":"-"},{"$f":"IF(B385=\"-\",\"-\",D384*(1+CALCULOS!$C$27))","v":"-"},{"$f":"IF(B385=\"-\",\"-\",IF(B385=1,CALCULOS!$C$47,IF(MOD(B384,12)=0,E383*(1+CALCULOS!$C$28),E384))*IF(MOD(B385,12)=0,2,1))","v":"-"},{"$f":"IF(B385=\"-\",\"-\",F384*(1+CALCULOS!$C$27)+E385)","v":"-"},"-"]
[null,{"$f":"IF(OR(B385>=CALCULOS!$F$18,B385=\"-\"),\"-\",B385+1)","v":"-"},{"$f":"IF(B386=\"-\",\"-\",CALCULOS!$F$14+B386)","v":"-"},{"$f":"IF(B386=\"-\",\"-\",D385*(1+CALCULOS!$C$27))","v":"-"},{"$f":"IF(B386=\"-\",\"-\",IF(B386=1,CALCULOS!$C$47,IF(MOD(B385,12)=0,E384*(1+CALCULOS!$C$28),E385))*IF(MOD(B386,12)=0,2,1))","v":"-"},{"$f":"IF(B386=\"-\",\"-\",F385*(1+CALCULOS!$C$27)+E386)","v":"-"},"-"]
[null,{"$f":"IF(OR(B386>=CALCULOS!$F$18,B386=\"-\"),\"-\",B386+1)","v":"-"},{"$f":"IF(B387=\"-\",\"-\",CALCULOS!$F$14+B387)","v":"-"},{"$f":"IF(B387=\"-\",\"-\",D386*(1+CALCULOS!$C$27))","v":"-"},{"$f":"IF(B387=\"-\",\"-\",IF(B387=1,CALCULOS!$C$47,IF(MOD(B386,12)=0,E385*(1+CALCULOS!$C$28),E386))*IF(MOD(B387,12)=0,2,1))","v":"-"},{"$f":"IF(B387=\"-\",\"-\",F386*(1+CALCULOS!$C$27)+E387)","v":"-"},"-"]
[null,{"$f":"IF(OR(B387>=CALCULOS!$F$18,B387=\"-\"),\"-\",B387+1)","v":"-"},{"$f":"IF(B388=\"-\",\"-\",CALCULOS!$F$14+B388)","v":"-"},{"$f":"IF(B388=\"-\",\"-\",D387*(1+CALCULOS!$C$27))","v":"-"},{"$f":"IF(B388=\"-\",\"-\",IF(B388=1,CALCULOS!$C$47,IF(MOD(B387,12)=0,E386*(1+CALCULOS!$C$28),E387))*IF(MOD(B388,12)=0,2,1))","v":"-"},{"$f":"IF(B388=\"-\",\"-\",F387*(1+CALCULOS!$C$27)+E388)","v":"-"},"-"]
[null,{"$f":"IF(OR(B388>=CALCULOS!$F$18,B388=\"-\"),\"-\",B388+1)","v":"-"},{"$f":"IF(B389=\"-\",\"-\",CALCULOS!$F$14+B389)","v":"-"},{"$f":"IF(B389=\"-\",\"-\",D388*(1+CALCULOS!$C$27))","v":"-"},{"$f":"IF(B389=\"-\",\"-\",IF(B389=1,CALCULOS!$C$47,IF(MOD(B388,12)=0,E387*(1+CALCULOS!$C$28),E388))*IF(MOD(B389,12)=0,2,1))","v":"-"},{"$f":"IF(B389=\"-\",\"-\",F388*(1+CALCULOS!$C$27)+E389)","v":"-"},"-"]
[null,{"$f":"IF(OR(B389>=CALCULOS!$F$18,B389=\"-\"),\"-\",B389+1)","v":"-"},{"$f":"IF(B390=\"-\",\"-\",CALCULOS!$F$14+B390)","v":"-"},{"$f":"IF(B390=\"-\",\"-\",D389*(1+CALCULOS!$C$27))","v":"-"},{"$f":"IF(B390=\"-\",\"-\",IF(B390=1,CALCULOS!$C$47,IF(MOD(B389,12)=0,E388*(1+CALCULOS!$C$28),E389))*IF(MOD(B390,12)=0,2,1))","v":"-"},{"$f":"IF(B390=\"-\",\"-\",F389*(1+CALCULOS!$C$27)+E390)","v":"-"},"-"]
[null,{"$f":"IF(OR(B390>=CALCULOS!$F$18,B390=\"-\"),\"-\",B390+1)","v":"-"},{"$f":"IF(B391=\"-\",\"-\",CALCULOS!$F$14+B391)","v":"-"},{"$f":"IF(B391=\"-\",\"-\",D390*(1+CALCULOS!$C$27))","v":"-"},{"$f":"IF(B391=\"-\",\"-\",IF(B391=1,CALCULOS!$C$47,IF(MOD(B390,12)=0,E389*(1+CALCULOS!$C$28),E390))*IF(MOD(B391,12)=0,2,1))","v":"-"},{"$f":"IF(B391=\"-\",\"-\",F390*(1+CALCULOS!$C$27)+E391)","v":"-"},"-"]
[null,{"$f":"IF(OR(B391>=CALCULOS!$F$18,B391=\"-\"),\"-\",B391+1)","v":"-"},{"$f":"IF(B392=\"-\",\"-\",CALCULOS!$F$14+B392)","v":"-"},{"$f":"IF(B392=\"-\",\"-\",D391*(1+CALCULOS!$C$27))","v":"-"},{"$f":"IF(B392=\"-\",\"-\",IF(B392=1,CALCULOS!$C$47,IF(MOD(B391,12)=0,E390*(1+CALCULOS!$C$28),E391))*IF(MOD(B392,12)=0,2,1))","v":"-"},{"$f":"IF(B392=\"-\",\"-\",F391*(1+CALCULOS!$C$27)+E392)","v":"-"},"-"]
[null,{"$f":"IF(OR(B392>=CALCULOS!$F$18,B392=\"-\"),\"-\",B392+1)","v":"-"},{"$f":"IF(B393=\"-\",\"-\",CALCULOS!$F$14+B393)","v":"-"},{"$f":"IF(B393=\"-\",\"-\",D392*(1+CALCULOS!$C$27))","v":"-"},{"$f":"IF(B393=\"-\",\"-\",IF(B393=1,CALCULOS!$C$47,IF(MOD(B392,12)=0,E391*(1+CALCULOS!$C$28),E392))*IF(MOD(B393,12)=0,2,1))","v":"-"},{"$f":"IF(B393=\"-\",\"-\",F392*(1+CALCULOS!$C$27)+E393)","v":"-"},"-"]
[null,{"$f":"IF(OR(B393>=CALCULOS!$F$18,B393=\"-\"),\"-\",B393+1)","v":"-"},{"$f":"IF(B394=\"-\",\"-\",CALCULOS!$F$14+B394)","v":"-"},{"$f":"IF(B394=\"-\",\"-\",D393*(1+CALCULOS!$C$27))","v":"-"},{"$f":"IF(B394=\"-\",\"-\",IF(B394=1,CALCULOS!$C$47,IF(MOD(B393,12)=0,E392*(1+CALCULOS!$C$28),E393))*IF(MOD(B394,12)=0,2,1))","v":"-"},{"$f":"IF(B394=\"-\",\"-\",F393*(1+CALCULOS!$C$27)+E394)","v":"-"},"-"]
[null,{"$f":"IF(OR(B394>=CALCULOS!$F$18,B394=\"-\"),\"-\",B394+1)","v":"-"},{"$f":"IF(B395=\"-\",\"-\",CALCULOS!$F$14+B395)","v":"-"},{"$f":"IF(B395=\"-\",\"-\",D394*(1+CALCULOS!$C$27))","v":"-"},{"$f":"IF(B395=\"-\",\"-\",IF(B395=1,CALCULOS!$C$47,IF(MOD(B394,12)=0,E393*(1+CALCULOS!$C$28),E394))*IF(MOD(B395,12)=0,2,1))","v":"-"},{"$f":"IF(B395=\"-\",\"-\",F394*(1+CALCULOS!$C$27)+E395)","v":"-"},"-"]
[null,{"$f":"IF(OR(B395>=CALCULOS!$F$18,B395=\"-\"),\"-\",B395+1)","v":"-"},{"$f":"IF(B396=\"-\",\"-\",CALCULOS!$F$14+B396)","v":"-"},{"$f":"IF(B396=\"-\",\"-\",D395*(1+CALCULOS!$C$27))","v":"-"},{"$f":"IF(B396=\"-\",\"-\",IF(B396=1,CALCULOS!$C$47,IF(MOD(B395,12)=0,E394*(1+CALCULOS!$C$28),E395))*IF(MOD(B396,12)=0,2,1))","v":"-"},{"$f":"IF(B396=\"-\",\"-\",F395*(1+CALCULOS!$C$27)+E396)","v":"-"},"-"]
[null,{"$f":"IF(OR(B396>=CALCULOS!$F$18,B396=\"-\"),\"-\",B396+1)","v":"-"},{"$f":"IF(B397=\"-\",\"-\",CALCULOS!$F$14+B397)","v":"-"},{"$f":"IF(B397=\"-\",\"-\",D396*(1+CALCULOS!$C$27))","v":"-"},{"$f":"IF(B397=\"-\",\"-\",IF(B397=1,CALCULOS!$C$47,IF(MOD(B396,12)=0,E395*(1+CALCULOS!$C$28),E396))*IF(MOD(B397,12)=0,2,1))","v":"-"},{"$f":"IF(B397=\"-\",\"-\",F396*(1+CALCULOS!$C$27)+E397)","v":"-"},"-"]
[null,{"$f":"IF(OR(B397>=CALCULOS!$F$18,B397=\"-\"),\"-\",B397+1)","v":"-"},{"$f":"IF(B398=\"-\",\"-\",CALCULOS!$F$14+B398)","v":"-"},{"$f":"IF(B398=\"-\",\"-\",D397*(1+CALCULOS!$C$27))","v":"-"},{"$f":"IF(B398=\"-\",\"-\",IF(B398=1,CALCULOS!$C$47,IF(MOD(B397,12)=0,E396*(1+CALCULOS!$C$28),E397))*IF(MOD(B398,12)=0,2,1))","v":"-"},{"$f":"IF(B398=\"-\",\"-\",F397*(1+CALCULOS!$C$27)+E398)","v":"-"},"-"]
[null,{"$f":"IF(OR(B398>=CALCULOS!$F$18,B398=\"-\"),\"-\",B398+1)","v":"-"},{"$f":"IF(B399=\"-\",\"-\",CALCULOS!$F$14+B399)","v":"-"},{"$f":"IF(B399=\"-\",\"-\",D398*(1+CALCULOS!$C$27))","v":"-"},{"$f":"IF(B399=\"-\",\"-\",IF(B399=1,CALCULOS!$C$47,IF(MOD(B398,12)=0,E397*(1+CALCULOS!$C$28),E398))*IF(MOD(B399,12)=0,2,1))","v":"-"},{"$f":"IF(B399=\"-\",\"-\",F398*(1+CALCULOS!$C$27)+E399)","v":"-"},"-"]
[null,{"$f":"IF(OR(B399>=CALCULOS!$F$18,B399=\"-\"),\"-\",B399+1)","v":"-"},{"$f":"IF(B400=\"-\",\"-\",CALCULOS!$F$14+B400)","v":"-"},{"$f":"IF(B400=\"-\",\"-\",D399*(1+CALCULOS!$C$27))","v":"-"},{"$f":"IF(B400=\"-\",\"-\",IF(B400=1,CALCULOS!$C$47,IF(MOD(B399,12)=0,E398*(1+CALCULOS!$C$28),E399))*IF(MOD(B400,12)=0,2,1))","v":"-"},{"$f":"IF(B400=\"-\",\"-\",F399*(1+CALCULOS!$C$27)+E400)","v":"-"},"-"]
[null,{"$f":"IF(OR(B400>=CALCULOS!$F$18,B400=\"-\"),\"-\",B400+1)","v":"-"},{"$f":"IF(B401=\"-\",\"-\",CALCULOS!$F$14+B401)","v":"-"},{"$f":"IF(B401=\"-\",\"-\",D400*(1+CALCULOS!$C$27))","v":"-"},{"$f":"IF(B401=\"-\",\"-\",IF(B401=1,CALCULOS!$C$47,IF(MOD(B400,12)=0,E399*(1+CALCULOS!$C$28),E400))*IF(MOD(B401,12)=0,2,1))","v":"-"},{"$f":"IF(B401=\"-\",\"-\",F400*(1+CALCULOS!$C$27)+E401)","v":"-"},"-"]
[null,{"$f":"IF(OR(B401>=CALCULOS!$F$18,B401=\"-\"),\"-\",B401+1)","v":"-"},{"$f":"IF(B402=\"-\",\"-\",CALCULOS!$F$14+B402)","v":"-"},{"$f":"IF(B402=\"-\",\"-\",D401*(1+CALCULOS!$C$27))","v":"-"},{"$f":"IF(B402=\"-\",\"-\",IF(B402=1,CALCULOS!$C$47,IF(MOD(B401,12)=0,E400*(1+CALCULOS!$C$28),E401))*IF(MOD(B402,12)=0,2,1))","v":"-"},{"$f":"IF(B402=\"-\",\"-\",F401*(1+CALCULOS!$C$27)+E402)","v":"-"},"-"]
[null,{"$f":"IF(OR(B402>=CALCULOS!$F$18,B402=\"-\"),\"-\",B402+1)","v":"-"},{"$f":"IF(B403=\"-\",\"-\",CALCULOS!$F$14+B403)","v":"-"},{"$f":"IF(B403=\"-\",\"-\",D402*(1+CALCULOS!$C$27))","v":"-"},{"$f":"IF(B403=\"-\",\"-\",IF(B403=1,CALCULOS!$C$47,IF(MOD(B402,12)=0,E401*(1+CALCULOS!$C$28),E402))*IF(MOD(B403,12)=0,2,1))","v":"-"},{"$f":"IF(B403=\"-\",\"-\",F402*(1+CALCULOS!$C$27)+E403)","v":"-"},"-"]
[null,{"$f":"IF(OR(B403>=CALCULOS!$F$18,B403=\"-\"),\"-\",B403+1)","v":"-"},{"$f":"IF(B404=\"-\",\"-\",CALCULOS!$F$14+B404)","v":"-"},{"$f":"IF(B404=\"-\",\"-\",D403*(1+CALCULOS!$C$27))","v":"-"},{"$f":"IF(B404=\"-\",\"-\",IF(B404=1,CALCULOS!$C$47,IF(MOD(B403,12)=0,E402*(1+CALCULOS!$C$28),E403))*IF(MOD(B404,12)=0,2,1))","v":"-"},{"$f":"IF(B404=\"-\",\"-\",F403*(1+CALCULOS!$C$27)+E404)","v":"-"},"-"]
[null,{"$f":"IF(OR(B404>=CALCULOS!$F$18,B404=\"-\"),\"-\",B404+1)","v":"-"},{"$f":"IF(B405=\"-\",\"-\",CALCULOS!$F$14+B405)","v":"-"},{"$f":"IF(B405=\"-\",\"-\",D404*(1+CALCULOS!$C$27))","v":"-"},{"$f":"IF(B405=\"-\",\"-\",IF(B405=1,CALCULOS!$C$47,IF(MOD(B404,12)=0,E403*(1+CALCULOS!$C$28),E404))*IF(MOD(B405,12)=0,2,1))","v":"-"},{"$f":"IF(B405=\"-\",\"-\",F404*(1+CALCULOS!$C$27)+E405)","v":"-"},"-"]
[null,{"$f":"IF(OR(B405>=CALCULOS!$F$18,B405=\"-\"),\"-\",B405+1)","v":"-"},{"$f":"IF(B406=\"-\",\"-\",CALCULOS!$F$14+B406)","v":"-"},{"$f":"IF(B406=\"-\",\"-\",D405*(1+CALCULOS!$C$27))","v":"-"},{"$f":"IF(B406=\"-\",\"-\",IF(B406=1,CALCULOS!$C$47,IF(MOD(B405,12)=0,E404*(1+CALCULOS!$C$28),E405))*IF(MOD(B406,12)=0,2,1))","v":"-"},{"$f":"IF(B406=\"-\",\"-\",F405*(1+CALCULOS!$C$27)+E406)","v":"-"},"-"]
[null,{"$f":"IF(OR(B406>=CALCULOS!$F$18,B406=\"-\"),\"-\",B406+1)","v":"-"},{"$f":"IF(B407=\"-\",\"-\",CALCULOS!$F$14+B407)","v":"-"},{"$f":"IF(B407=\"-\",\"-\",D406*(1+CALCULOS!$C$27))","v":"-"},{"$f":"IF(B407=\"-\",\"-\",IF(B407=1,CALCULOS!$C$47,IF(MOD(B406,12)=0,E405*(1+CALCULOS!$C$28),E406))*IF(MOD(B407,12)=0,2,1))","v":"-"},{"$f":"IF(B407=\"-\",\"-\",F406*(1+CALCULOS!$C$27)+E407)","v":"-"},"-"]
[null,{"$f":"IF(OR(B407>=CALCULOS!$F$18,B407=\"-\"),\"-\",B407+1)","v":"-"},{"$f":"IF(B408=\"-\",\"-\",CALCULOS!$F$14+B408)","v":"-"},{"$f":"IF(B408=\"-\",\"-\",D407*(1+CALCULOS!$C$27))","v":"-"},{"$f":"IF(B408=\"-\",\"-\",IF(B408=1,CALCULOS!$C$47,IF(MOD(B407,12)=0,E406*(1+CALCULOS!$C$28),E407))*IF(MOD(B408,12)=0,2,1))","v":"-"},{"$f":"IF(B408=\"-\",\"-\",F407*(1+CALCULOS!$C$27)+E408)","v":"-"},"-"]
[null,{"$f":"IF(OR(B408>=CALCULOS!$F$18,B408=\"-\"),\"-\",B408+1)","v":"-"},{"$f":"IF(B409=\"-\",\"-\",CALCULOS!$F$14+B409)","v":"-"},{"$f":"IF(B409=\"-\",\"-\",D408*(1+CALCULOS!$C$27))","v":"-"},{"$f":"IF(B409=\"-\",\"-\",IF(B409=1,CALCULOS!$C$47,IF(MOD(B408,12)=0,E407*(1+CALCULOS!$C$28),E408))*IF(MOD(B409,12)=0,2,1))","v":"-"},{"$f":"IF(B409=\"-\",\"-\",F408*(1+CALCULOS!$C$27)+E409)","v":"-"},{"$f":"IF(B409=\"-\",\"-\",SUM(D409,F409))","v":"-"}]
[null,{"$f":"IF(OR(B409>=CALCULOS!$F$18,B409=\"-\"),\"-\",B409+1)","v":"-"},{"$f":"IF(B410=\"-\",\"-\",CALCULOS!$F$14+B410)","v":"-"},{"$f":"IF(B410=\"-\",\"-\",D409*(1+CALCULOS!$C$27))","v":"-"},{"$f":"IF(B410=\"-\",\"-\",IF(B410=1,CALCULOS!$C$47,IF(MOD(B409,12)=0,E408*(1+CALCULOS!$C$28),E409))*IF(MOD(B410,12)=0,2,1))","v":"-"},{"$f":"IF(B410=\"-\",\"-\",F409*(1+CALCULOS!$C$27)+E410)","v":"-"},"-"]
[null,{"$f":"IF(OR(B410>=CALCULOS!$F$18,B410=\"-\"),\"-\",B410+1)","v":"-"},{"$f":"IF(B411=\"-\",\"-\",CALCULOS!$F$14+B411)","v":"-"},{"$f":"IF(B411=\"-\",\"-\",D410*(1+CALCULOS!$C$27))","v":"-"},{"$f":"IF(B411=\"-\",\"-\",IF(B411=1,CALCULOS!$C$47,IF(MOD(B410,12)=0,E409*(1+CALCULOS!$C$28),E410))*IF(MOD(B411,12)=0,2,1))","v":"-"},{"$f":"IF(B411=\"-\",\"-\",F410*(1+CALCULOS!$C$27)+E411)","v":"-"},"-"]
[null,{"$f":"IF(OR(B411>=CALCULOS!$F$18,B411=\"-\"),\"-\",B411+1)","v":"-"},{"$f":"IF(B412=\"-\",\"-\",CALCULOS!$F$14+B412)","v":"-"},{"$f":"IF(B412=\"-\",\"-\",D411*(1+CALCULOS!$C$27))","v":"-"},{"$f":"IF(B412=\"-\",\"-\",IF(B412=1,CALCULOS!$C$47,IF(MOD(B411,12)=0,E410*(1+CALCULOS!$C$28),E411))*IF(MOD(B412,12)=0,2,1))","v":"-"},{"$f":"IF(B412=\"-\",\"-\",F411*(1+CALCULOS!$C$27)+E412)","v":"-"},"-"]
[null,{"$f":"IF(OR(B412>=CALCULOS!$F$18,B412=\"-\"),\"-\",B412+1)","v":"-"},{"$f":"IF(B413=\"-\",\"-\",CALCULOS!$F$14+B413)","v":"-"},{"$f":"IF(B413=\"-\",\"-\",D412*(1+CALCULOS!$C$27))","v":"-"},{"$f":"IF(B413=\"-\",\"-\",IF(B413=1,CALCULOS!$C$47,IF(MOD(B412,12)=0,E411*(1+CALCULOS!$C$28),E412))*IF(MOD(B413,12)=0,2,1))","v":"-"},{"$f":"IF(B413=\"-\",\"-\",F412*(1+CALCULOS!$C$27)+E413)","v":"-"},"-"]
[null,{"$f":"IF(OR(B413>=CALCULOS!$F$18,B413=\"-\"),\"-\",B413+1)","v":"-"},{"$f":"IF(B414=\"-\",\"-\",CALCULOS!$F$14+B414)","v":"-"},{"$f":"IF(B414=\"-\",\"-\",D413*(1+CALCULOS!$C$27))","v":"-"},{"$f":"IF(B414=\"-\",\"-\",IF(B414=1,CALCULOS!$C$47,IF(MOD(B413,12)=0,E412*(1+CALCULOS!$C$28),E413))*IF(MOD(B414,12)=0,2,1))","v":"-"},{"$f":"IF(B414=\"-\",\"-\",F413*(1+CALCULOS!$C$27)+E414)","v":"-"},"-"]
[null,{"$f":"IF(OR(B414>=CALCULOS!$F$18,B414=\"-\"),\"-\",B414+1)","v":"-"},{"$f":"IF(B415=\"-\",\"-\",CALCULOS!$F$14+B415)","v":"-"},{"$f":"IF(B415=\"-\",\"-\",D414*(1+CALCULOS!$C$27))","v":"-"},{"$f":"IF(B415=\"-\",\"-\",IF(B415=1,CALCULOS!$C$47,IF(MOD(B414,12)=0,E413*(1+CALCULOS!$C$28),E414))*IF(MOD(B415,12)=0,2,1))","v":"-"},{"$f":"IF(B415=\"-\",\"-\",F414*(1+CALCULOS!$C$27)+E415)","v":"-"},"-"]
[null,{"$f":"IF(OR(B415>=CALCULOS!$F$18,B415=\"-\"),\"-\",B415+1)","v":"-"},{"$f":"IF(B416=\"-\",\"-\",CALCULOS!$F$14+B416)","v":"-"},{"$f":"IF(B416=\"-\",\"-\",D415*(1+CALCULOS!$C$27))","v":"-"},{"$f":"IF(B416=\"-\",\"-\",IF(B416=1,CALCULOS!$C$47,IF(MOD(B415,12)=0,E414*(1+CALCULOS!$C$28),E415))*IF(MOD(B416,12)=0,2,1))","v":"-"},{"$f":"IF(B416=\"-\",\"-\",F415*(1+CALCULOS!$C$27)+E416)","v":"-"},"-"]
[null,{"$f":"IF(OR(B416>=CALCULOS!$F$18,B416=\"-\"),\"-\",B416+1)","v":"-"},{"$f":"IF(B417=\"-\",\"-\",CALCULOS!$F$14+B417)","v":"-"},{"$f":"IF(B417=\"-\",\"-\",D416*(1+CALCULOS!$C$27))","v":"-"},{"$f":"IF(B417=\"-\",\"-\",IF(B417=1,CALCULOS!$C$47,IF(MOD(B416,12)=0,E415*(1+CALCULOS!$C$28),E416))*IF(MOD(B417,12)=0,2,1))","v":"-"},{"$f":"IF(B417=\"-\",\"-\",F416*(1+CALCULOS!$C$27)+E417)","v":"-"},"-"]
[null,{"$f":"IF(OR(B417>=CALCULOS!$F$18,B417=\"-\"),\"-\",B417+1)","v":"-"},{"$f":"IF(B418=\"-\",\"-\",CALCULOS!$F$14+B418)","v":"-"},{"$f":"IF(B418=\"-\",\"-\",D417*(1+CALCULOS!$C$27))","v":"-"},{"$f":"IF(B418=\"-\",\"-\",IF(B418=1,CALCULOS!$C$47,IF(MOD(B417,12)=0,E416*(1+CALCULOS!$C$28),E417))*IF(MOD(B418,12)=0,2,1))","v":"-"},{"$f":"IF(B418=\"-\",\"-\",F417*(1+CALCULOS!$C$27)+E418)","v":"-"},"-"]
[null,{"$f":"IF(OR(B418>=CALCULOS!$F$18,B418=\"-\"),\"-\",B418+1)","v":"-"},{"$f":"IF(B419=\"-\",\"-\",CALCULOS!$F$14+B419)","v":"-"},{"$f":"IF(B419=\"-\",\"-\",D418*(1+CALCULOS!$C$27))","v":"-"},{"$f":"IF(B419=\"-\",\"-\",IF(B419=1,CALCULOS!$C$47,IF(MOD(B418,12)=0,E417*(1+CALCULOS!$C$28),E418))*IF(MOD(B419,12)=0,2,1))","v":"-"},{"$f":"IF(B419=\"-\",\"-\",F418*(1+CALCULOS!$C$27)+E419)","v":"-"},"-"]
[null,{"$f":"IF(OR(B419>=CALCULOS!$F$18,B419=\"-\"),\"-\",B419+1)","v":"-"},{"$f":"IF(B420=\"-\",\"-\",CALCULOS!$F$14+B420)","v":"-"},{"$f":"IF(B420=\"-\",\"-\",D419*(1+CALCULOS!$C$27))","v":"-"},{"$f":"IF(B420=\"-\",\"-\",IF(B420=1,CALCULOS!$C$47,IF(MOD(B419,12)=0,E418*(1+CALCULOS!$C$28),E419))*IF(MOD(B420,12)=0,2,1))","v":"-"},{"$f":"IF(B420=\"-\",\"-\",F419*(1+CALCULOS!$C$27)+E420)","v":"-"},"-"]
[null,{"$f":"IF(OR(B420>=CALCULOS!$F$18,B420=\"-\"),\"-\",B420+1)","v":"-"},{"$f":"IF(B421=\"-\",\"-\",CALCULOS!$F$14+B421)","v":"-"},{"$f":"IF(B421=\"-\",\"-\",D420*(1+CALCULOS!$C$27))","v":"-"},{"$f":"IF(B421=\"-\",\"-\",IF(B421=1,CALCULOS!$C$47,IF(MOD(B420,12)=0,E419*(1+CALCULOS!$C$28),E420))*IF(MOD(B421,12)=0,2,1))","v":"-"},{"$f":"IF(B421=\"-\",\"-\",F420*(1+CALCULOS!$C$27)+E421)","v":"-"},"-"]
[null,{"$f":"IF(OR(B421>=CALCULOS!$F$18,B421=\"-\"),\"-\",B421+1)","v":"-"},{"$f":"IF(B422=\"-\",\"-\",CALCULOS!$F$14+B422)","v":"-"},{"$f":"IF(B422=\"-\",\"-\",D421*(1+CALCULOS!$C$27))","v":"-"},{"$f":"IF(B422=\"-\",\"-\",IF(B422=1,CALCULOS!$C$47,IF(MOD(B421,12)=0,E420*(1+CALCULOS!$C$28),E421))*IF(MOD(B422,12)=0,2,1))","v":"-"},{"$f":"IF(B422=\"-\",\"-\",F421*(1+CALCULOS!$C$27)+E422)","v":"-"},"-"]
[null,{"$f":"IF(OR(B422>=CALCULOS!$F$18,B422=\"-\"),\"-\",B422+1)","v":"-"},{"$f":"IF(B423=\"-\",\"-\",CALCULOS!$F$14+B423)","v":"-"},{"$f":"IF(B423=\"-\",\"-\",D422*(1+CALCULOS!$C$27))","v":"-"},{"$f":"IF(B423=\"-\",\"-\",IF(B423=1,CALCULOS!$C$47,IF(MOD(B422,12)=0,E421*(1+CALCULOS!$C$28),E422))*IF(MOD(B423,12)=0,2,1))","v":"-"},{"$f":"IF(B423=\"-\",\"-\",F422*(1+CALCULOS!$C$27)+E423)","v":"-"},"-"]
[null,{"$f":"IF(OR(B423>=CALCULOS!$F$18,B423=\"-\"),\"-\",B423+1)","v":"-"},{"$f":"IF(B424=\"-\",\"-\",CALCULOS!$F$14+B424)","v":"-"},{"$f":"IF(B424=\"-\",\"-\",D423*(1+CALCULOS!$C$27))","v":"-"},{"$f":"IF(B424=\"-\",\"-\",IF(B424=1,CALCULOS!$C$47,IF(MOD(B423,12)=0,E422*(1+CALCULOS!$C$28),E423))*IF(MOD(B424,12)=0,2,1))","v":"-"},{"$f":"IF(B424=\"-\",\"-\",F423*(1+CALCULOS!$C$27)+E424)","v":"-"},"-"]
[null,{"$f":"IF(OR(B424>=CALCULOS!$F$18,B424=\"-\"),\"-\",B424+1)","v":"-"},{"$f":"IF(B425=\"-\",\"-\",CALCULOS!$F$14+B425)","v":"-"},{"$f":"IF(B425=\"-\",\"-\",D424*(1+CALCULOS!$C$27))","v":"-"},{"$f":"IF(B425=\"-\",\"-\",IF(B425=1,CALCULOS!$C$47,IF(MOD(B424,12)=0,E423*(1+CALCULOS!$C$28),E424))*IF(MOD(B425,12)=0,2,1))","v":"-"},{"$f":"IF(B425=\"-\",\"-\",F424*(1+CALCULOS!$C$27)+E425)","v":"-"},"-"]
[null,{"$f":"IF(OR(B425>=CALCULOS!$F$18,B425=\"-\"),\"-\",B425+1)","v":"-"},{"$f":"IF(B426=\"-\",\"-\",CALCULOS!$F$14+B426)","v":"-"},{"$f":"IF(B426=\"-\",\"-\",D425*(1+CALCULOS!$C$27))","v":"-"},{"$f":"IF(B426=\"-\",\"-\",IF(B426=1,CALCULOS!$C$47,IF(MOD(B425,12)=0,E424*(1+CALCULOS!$C$28),E425))*IF(MOD(B426,12)=0,2,1))","v":"-"},{"$f":"IF(B426=\"-\",\"-\",F425*(1+CALCULOS!$C$27)+E426)","v":"-"},"-"]
[null,{"$f":"IF(OR(B426>=CALCULOS!$F$18,B426=\"-\"),\"-\",B426+1)","v":"-"},{"$f":"IF(B427=\"-\",\"-\",CALCULOS!$F$14+B427)","v":"-"},{"$f":"IF(B427=\"-\",\"-\",D426*(1+CALCULOS!$C$27))","v":"-"},{"$f":"IF(B427=\"-\",\"-\",IF(B427=1,CALCULOS!$C$47,IF(MOD(B426,12)=0,E425*(1+CALCULOS!$C$28),E426))*IF(MOD(B427,12)=0,2,1))","v":"-"},{"$f":"IF(B427=\"-\",\"-\",F426*(1+CALCULOS!$C$27)+E427)","v":"-"},"-"]
[null,{"$f":"IF(OR(B427>=CALCULOS!$F$18,B427=\"-\"),\"-\",B427+1)","v":"-"},{"$f":"IF(B428=\"-\",\"-\",CALCULOS!$F$14+B428)","v":"-"},{"$f":"IF(B428=\"-\",\"-\",D427*(1+CALCULOS!$C$27))","v":"-"},{"$f":"IF(B428=\"-\",\"-\",IF(B428=1,CALCULOS!$C$47,IF(MOD(B427,12)=0,E426*(1+CALCULOS!$C$28),E427))*IF(MOD(B428,12)=0,2,1))","v":"-"},{"$f":"IF(B428=\"-\",\"-\",F427*(1+CALCULOS!$C$27)+E428)","v":"-"},"-"]
[null,{"$f":"IF(OR(B428>=CALCULOS!$F$18,B428=\"-\"),\"-\",B428+1)","v":"-"},{"$f":"IF(B429=\"-\",\"-\",CALCULOS!$F$14+B429)","v":"-"},{"$f":"IF(B429=\"-\",\"-\",D428*(1+CALCULOS!$C$27))","v":"-"},{"$f":"IF(B429=\"-\",\"-\",IF(B429=1,CALCULOS!$C$47,IF(MOD(B428,12)=0,E427*(1+CALCULOS!$C$28),E428))*IF(MOD(B429,12)=0,2,1))","v":"-"},{"$f":"IF(B429=\"-\",\"-\",F428*(1+CALCULOS!$C$27)+E429)","v":"-"},"-"]
[null,{"$f":"IF(OR(B429>=CALCULOS!$F$18,B429=\"-\"),\"-\",B429+1)","v":"-"},{"$f":"IF(B430=\"-\",\"-\",CALCULOS!$F$14+B430)","v":"-"},{"$f":"IF(B430=\"-\",\"-\",D429*(1+CALCULOS!$C$27))","v":"-"},{"$f":"IF(B430=\"-\",\"-\",IF(B430=1,CALCULOS!$C$47,IF(MOD(B429,12)=0,E428*(1+CALCULOS!$C$28),E429))*IF(MOD(B430,12)=0,2,1))","v":"-"},{"$f":"IF(B430=\"-\",\"-\",F429*(1+CALCULOS!$C$27)+E430)","v":"-"},"-"]
[null,{"$f":"IF(OR(B430>=CALCULOS!$F$18,B430=\"-\"),\"-\",B430+1)","v":"-"},{"$f":"IF(B431=\"-\",\"-\",CALCULOS!$F$14+B431)","v":"-"},{"$f":"IF(B431=\"-\",\"-\",D430*(1+CALCULOS!$C$27))","v":"-"},{"$f":"IF(B431=\"-\",\"-\",IF(B431=1,CALCULOS!$C$47,IF(MOD(B430,12)=0,E429*(1+CALCULOS!$C$28),E430))*IF(MOD(B431,12)=0,2,1))","v":"-"},{"$f":"IF(B431=\"-\",\"-\",F430*(1+CALCULOS!$C$27)+E431)","v":"-"},"-"]
[null,{"$f":"IF(OR(B431>=CALCULOS!$F$18,B431=\"-\"),\"-\",B431+1)","v":"-"},{"$f":"IF(B432=\"-\",\"-\",CALCULOS!$F$14+B432)","v":"-"},{"$f":"IF(B432=\"-\",\"-\",D431*(1+CALCULOS!$C$27))","v":"-"},{"$f":"IF(B432=\"-\",\"-\",IF(B432=1,CALCULOS!$C$47,IF(MOD(B431,12)=0,E430*(1+CALCULOS!$C$28),E431))*IF(MOD(B432,12)=0,2,1))","v":"-"},{"$f":"IF(B432=\"-\",\"-\",F431*(1+CALCULOS!$C$27)+E432)","v":"-"},"-"]
[null,{"$f":"IF(OR(B432>=CALCULOS!$F$18,B432=\"-\"),\"-\",B432+1)","v":"-"},{"$f":"IF(B433=\"-\",\"-\",CALCULOS!$F$14+B433)","v":"-"},{"$f":"IF(B433=\"-\",\"-\",D432*(1+CALCULOS!$C$27))","v":"-"},{"$f":"IF(B433=\"-\",\"-\",IF(B433=1,CALCULOS!$C$47,IF(MOD(B432,12)=0,E431*(1+CALCULOS!$C$28),E432))*IF(MOD(B433,12)=0,2,1))","v":"-"},{"$f":"IF(B433=\"-\",\"-\",F432*(1+CALCULOS!$C$27)+E433)","v":"-"},"-"]
[null,{"$f":"IF(OR(B433>=CALCULOS!$F$18,B433=\"-\"),\"-\",B433+1)","v":"-"},{"$f":"IF(B434=\"-\",\"-\",CALCULOS!$F$14+B434)","v":"-"},{"$f":"IF(B434=\"-\",\"-\",D433*(1+CALCULOS!$C$27))","v":"-"},{"$f":"IF(B434=\"-\",\"-\",IF(B434=1,CALCULOS!$C$47,IF(MOD(B433,12)=0,E432*(1+CALCULOS!$C$28),E433))*IF(MOD(B434,12)=0,2,1))","v":"-"},{"$f":"IF(B434=\"-\",\"-\",F433*(1+CALCULOS!$C$27)+E434)","v":"-"},"-"]
[null,{"$f":"IF(OR(B434>=CALCULOS!$F$18,B434=\"-\"),\"-\",B434+1)","v":"-"},{"$f":"IF(B435=\"-\",\"-\",CALCULOS!$F$14+B435)","v":"-"},{"$f":"IF(B435=\"-\",\"-\",D434*(1+CALCULOS!$C$27))","v":"-"},{"$f":"IF(B435=\"-\",\"-\",IF(B435=1,CALCULOS!$C$47,IF(MOD(B434,12)=0,E433*(1+CALCULOS!$C$28),E434))*IF(MOD(B435,12)=0,2,1))","v":"-"},{"$f":"IF(B435=\"-\",\"-\",F434*(1+CALCULOS!$C$27)+E435)","v":"-"},"-"]
[null,{"$f":"IF(OR(B435>=CALCULOS!$F$18,B435=\"-\"),\"-\",B435+1)","v":"-"},{"$f":"IF(B436=\"-\",\"-\",CALCULOS!$F$14+B436)","v":"-"},{"$f":"IF(B436=\"-\",\"-\",D435*(1+CALCULOS!$C$27))","v":"-"},{"$f":"IF(B436=\"-\",\"-\",IF(B436=1,CALCULOS!$C$47,IF(MOD(B435,12)=0,E434*(1+CALCULOS!$C$28),E435))*IF(MOD(B436,12)=0,2,1))","v":"-"},{"$f":"IF(B436=\"-\",\"-\",F435*(1+CALCULOS!$C$27)+E436)","v":"-"},"-"]
[null,{"$f":"IF(OR(B436>=CALCULOS!$F$18,B436=\"-\"),\"-\",B436+1)","v":"-"},{"$f":"IF(B437=\"-\",\"-\",CALCULOS!$F$14+B437)","v":"-"},{"$f":"IF(B437=\"-\",\"-\",D436*(1+CALCULOS!$C$27))","v":"-"},{"$f":"IF(B437=\"-\",\"-\",IF(B437=1,CALCULOS!$C$47,IF(MOD(B436,12)=0,E435*(1+CALCULOS!$C$28),E436))*IF(MOD(B437,12)=0,2,1))","v":"-"},{"$f":"IF(B437=\"-\",\"-\",F436*(1+CALCULOS!$C$27)+E437)","v":"-"},"-"]
[null,{"$f":"IF(OR(B437>=CALCULOS!$F$18,B437=\"-\"),\"-\",B437+1)","v":"-"},{"$f":"IF(B438=\"-\",\"-\",CALCULOS!$F$14+B438)","v":"-"},{"$f":"IF(B438=\"-\",\"-\",D437*(1+CALCULOS!$C$27))","v":"-"},{"$f":"IF(B438=\"-\",\"-\",IF(B438=1,CALCULOS!$C$47,IF(MOD(B437,12)=0,E436*(1+CALCULOS!$C$28),E437))*IF(MOD(B438,12)=0,2,1))","v":"-"},{"$f":"IF(B438=\"-\",\"-\",F437*(1+CALCULOS!$C$27)+E438)","v":"-"},"-"]
[null,{"$f":"IF(OR(B438>=CALCULOS!$F$18,B438=\"-\"),\"-\",B438+1)","v":"-"},{"$f":"IF(B439=\"-\",\"-\",CALCULOS!$F$14+B439)","v":"-"},{"$f":"IF(B439=\"-\",\"-\",D438*(1+CALCULOS!$C$27))","v":"-"},{"$f":"IF(B439=\"-\",\"-\",IF(B439=1,CALCULOS!$C$47,IF(MOD(B438,12)=0,E437*(1+CALCULOS!$C$28),E438))*IF(MOD(B439,12)=0,2,1))","v":"-"},{"$f":"IF(B439=\"-\",\"-\",F438*(1+CALCULOS!$C$27)+E439)","v":"-"},"-"]
[null,{"$f":"IF(OR(B439>=CALCULOS!$F$18,B439=\"-\"),\"-\",B439+1)","v":"-"},{"$f":"IF(B440=\"-\",\"-\",CALCULOS!$F$14+B440)","v":"-"},{"$f":"IF(B440=\"-\",\"-\",D439*(1+CALCULOS!$C$27))","v":"-"},{"$f":"IF(B440=\"-\",\"-\",IF(B440=1,CALCULOS!$C$47,IF(MOD(B439,12)=0,E438*(1+CALCULOS!$C$28),E439))*IF(MOD(B440,12)=0,2,1))","v":"-"},{"$f":"IF(B440=\"-\",\"-\",F439*(1+CALCULOS!$C$27)+E440)","v":"-"},"-"]
[null,{"$f":"IF(OR(B440>=CALCULOS!$F$18,B440=\"-\"),\"-\",B440+1)","v":"-"},{"$f":"IF(B441=\"-\",\"-\",CALCULOS!$F$14+B441)","v":"-"},{"$f":"IF(B441=\"-\",\"-\",D440*(1+CALCULOS!$C$27))","v":"-"},{"$f":"IF(B441=\"-\",\"-\",IF(B441=1,CALCULOS!$C$47,IF(MOD(B440,12)=0,E439*(1+CALCULOS!$C$28),E440))*IF(MOD(B441,12)=0,2,1))","v":"-"},{"$f":"IF(B441=\"-\",\"-\",F440*(1+CALCULOS!$C$27)+E441)","v":"-"},"-"]
[null,{"$f":"IF(OR(B441>=CALCULOS!$F$18,B441=\"-\"),\"-\",B441+1)","v":"-"},{"$f":"IF(B442=\"-\",\"-\",CALCULOS!$F$14+B442)","v":"-"},{"$f":"IF(B442=\"-\",\"-\",D441*(1+CALCULOS!$C$27))","v":"-"},{"$f":"IF(B442=\"-\",\"-\",IF(B442=1,CALCULOS!$C$47,IF(MOD(B441,12)=0,E440*(1+CALCULOS!$C$28),E441))*IF(MOD(B442,12)=0,2,1))","v":"-"},{"$f":"IF(B442=\"-\",\"-\",F441*(1+CALCULOS!$C$27)+E442)","v":"-"},"-"]
[null,{"$f":"IF(OR(B442>=CALCULOS!$F$18,B442=\"-\"),\"-\",B442+1)","v":"-"},{"$f":"IF(B443=\"-\",\"-\",CALCULOS!$F$14+B443)","v":"-"},{"$f":"IF(B443=\"-\",\"-\",D442*(1+CALCULOS!$C$27))","v":"-"},{"$f":"IF(B443=\"-\",\"-\",IF(B443=1,CALCULOS!$C$47,IF(MOD(B442,12)=0,E441*(1+CALCULOS!$C$28),E442))*IF(MOD(B443,12)=0,2,1))","v":"-"},{"$f":"IF(B443=\"-\",\"-\",F442*(1+CALCULOS!$C$27)+E443)","v":"-"},"-"]
[null,{"$f":"IF(OR(B443>=CALCULOS!$F$18,B443=\"-\"),\"-\",B443+1)","v":"-"},{"$f":"IF(B444=\"-\",\"-\",CALCULOS!$F$14+B444)","v":"-"},{"$f":"IF(B444=\"-\",\"-\",D443*(1+CALCULOS!$C$27))","v":"-"},{"$f":"IF(B444=\"-\",\"-\",IF(B444=1,CALCULOS!$C$47,IF(MOD(B443,12)=0,E442*(1+CALCULOS!$C$28),E443))*IF(MOD(B444,12)=0,2,1))","v":"-"},{"$f":"IF(B444=\"-\",\"-\",F443*(1+CALCULOS!$C$27)+E444)","v":"-"},"-"]
[null,{"$f":"IF(OR(B444>=CALCULOS!$F$18,B444=\"-\"),\"-\",B444+1)","v":"-"},{"$f":"IF(B445=\"-\",\"-\",CALCULOS!$F$14+B445)","v":"-"},{"$f":"IF(B445=\"-\",\"-\",D444*(1+CALCULOS!$C$27))","v":"-"},{"$f":"IF(B445=\"-\",\"-\",IF(B445=1,CALCULOS!$C$47,IF(MOD(B444,12)=0,E443*(1+CALCULOS!$C$28),E444))*IF(MOD(B445,12)=0,2,1))","v":"-"},{"$f":"IF(B445=\"-\",\"-\",F444*(1+CALCULOS!$C$27)+E445)","v":"-"},"-"]
[null,{"$f":"IF(OR(B445>=CALCULOS!$F$18,B445=\"-\"),\"-\",B445+1)","v":"-"},{"$f":"IF(B446=\"-\",\"-\",CALCULOS!$F$14+B446)","v":"-"},{"$f":"IF(B446=\"-\",\"-\",D445*(1+CALCULOS!$C$27))","v":"-"},{"$f":"IF(B446=\"-\",\"-\",IF(B446=1,CALCULOS!$C$47,IF(MOD(B445,12)=0,E444*(1+CALCULOS!$C$28),E445))*IF(MOD(B446,12)=0,2,1))","v":"-"},{"$f":"IF(B446=\"-\",\"-\",F445*(1+CALCULOS!$C$27)+E446)","v":"-"},"-"]
[null,{"$f":"IF(OR(B446>=CALCULOS!$F$18,B446=\"-\"),\"-\",B446+1)","v":"-"},{"$f":"IF(B447=\"-\",\"-\",CALCULOS!$F$14+B447)","v":"-"},{"$f":"IF(B447=\"-\",\"-\",D446*(1+CALCULOS!$C$27))","v":"-"},{"$f":"IF(B447=\"-\",\"-\",IF(B447=1,CALCULOS!$C$47,IF(MOD(B446,12)=0,E445*(1+CALCULOS!$C$28),E446))*IF(MOD(B447,12)=0,2,1))","v":"-"},{"$f":"IF(B447=\"-\",\"-\",F446*(1+CALCULOS!$C$27)+E447)","v":"-"},"-"]
[null,{"$f":"IF(OR(B447>=CALCULOS!$F$18,B447=\"-\"),\"-\",B447+1)","v":"-"},{"$f":"IF(B448=\"-\",\"-\",CALCULOS!$F$14+B448)","v":"-"},{"$f":"IF(B448=\"-\",\"-\",D447*(1+CALCULOS!$C$27))","v":"-"},{"$f":"IF(B448=\"-\",\"-\",IF(B448=1,CALCULOS!$C$47,IF(MOD(B447,12)=0,E446*(1+CALCULOS!$C$28),E447))*IF(MOD(B448,12)=0,2,1))","v":"-"},{"$f":"IF(B448=\"-\",\"-\",F447*(1+CALCULOS!$C$27)+E448)","v":"-"},"-"]
[null,{"$f":"IF(OR(B448>=CALCULOS!$F$18,B448=\"-\"),\"-\",B448+1)","v":"-"},{"$f":"IF(B449=\"-\",\"-\",CALCULOS!$F$14+B449)","v":"-"},{"$f":"IF(B449=\"-\",\"-\",D448*(1+CALCULOS!$C$27))","v":"-"},{"$f":"IF(B449=\"-\",\"-\",IF(B449=1,CALCULOS!$C$47,IF(MOD(B448,12)=0,E447*(1+CALCULOS!$C$28),E448))*IF(MOD(B449,12)=0,2,1))","v":"-"},{"$f":"IF(B449=\"-\",\"-\",F448*(1+CALCULOS!$C$27)+E449)","v":"-"},"-"]
[null,{"$f":"IF(OR(B449>=CALCULOS!$F$18,B449=\"-\"),\"-\",B449+1)","v":"-"},{"$f":"IF(B450=\"-\",\"-\",CALCULOS!$F$14+B450)","v":"-"},{"$f":"IF(B450=\"-\",\"-\",D449*(1+CALCULOS!$C$27))","v":"-"},{"$f":"IF(B450=\"-\",\"-\",IF(B450=1,CALCULOS!$C$47,IF(MOD(B449,12)=0,E448*(1+CALCULOS!$C$28),E449))*IF(MOD(B450,12)=0,2,1))","v":"-"},{"$f":"IF(B450=\"-\",\"-\",F449*(1+CALCULOS!$C$27)+E450)","v":"-"},"-"]
[null,{"$f":"IF(OR(B450>=CALCULOS!$F$18,B450=\"-\"),\"-\",B450+1)","v":"-"},{"$f":"IF(B451=\"-\",\"-\",CALCULOS!$F$14+B451)","v":"-"},{"$f":"IF(B451=\"-\",\"-\",D450*(1+CALCULOS!$C$27))","v":"-"},{"$f":"IF(B451=\"-\",\"-\",IF(B451=1,CALCULOS!$C$47,IF(MOD(B450,12)=0,E449*(1+CALCULOS!$C$28),E450))*IF(MOD(B451,12)=0,2,1))","v":"-"},{"$f":"IF(B451=\"-\",\"-\",F450*(1+CALCULOS!$C$27)+E451)","v":"-"},"-"]
[null,{"$f":"IF(OR(B451>=CALCULOS!$F$18,B451=\"-\"),\"-\",B451+1)","v":"-"},{"$f":"IF(B452=\"-\",\"-\",CALCULOS!$F$14+B452)","v":"-"},{"$f":"IF(B452=\"-\",\"-\",D451*(1+CALCULOS!$C$27))","v":"-"},{"$f":"IF(B452=\"-\",\"-\",IF(B452=1,CALCULOS!$C$47,IF(MOD(B451,12)=0,E450*(1+CALCULOS!$C$28),E451))*IF(MOD(B452,12)=0,2,1))","v":"-"},{"$f":"IF(B452=\"-\",\"-\",F451*(1+CALCULOS!$C$27)+E452)","v":"-"},"-"]
[null,{"$f":"IF(OR(B452>=CALCULOS!$F$18,B452=\"-\"),\"-\",B452+1)","v":"-"},{"$f":"IF(B453=\"-\",\"-\",CALCULOS!$F$14+B453)","v":"-"},{"$f":"IF(B453=\"-\",\"-\",D452*(1+CALCULOS!$C$27))","v":"-"},{"$f":"IF(B453=\"-\",\"-\",IF(B453=1,CALCULOS!$C$47,IF(MOD(B452,12)=0,E451*(1+CALCULOS!$C$28),E452))*IF(MOD(B453,12)=0,2,1))","v":"-"},{"$f":"IF(B453=\"-\",\"-\",F452*(1+CALCULOS!$C$27)+E453)","v":"-"},"-"]
[null,{"$f":"IF(OR(B453>=CALCULOS!$F$18,B453=\"-\"),\"-\",B453+1)","v":"-"},{"$f":"IF(B454=\"-\",\"-\",CALCULOS!$F$14+B454)","v":"-"},{"$f":"IF(B454=\"-\",\"-\",D453*(1+CALCULOS!$C$27))","v":"-"},{"$f":"IF(B454=\"-\",\"-\",IF(B454=1,CALCULOS!$C$47,IF(MOD(B453,12)=0,E452*(1+CALCULOS!$C$28),E453))*IF(MOD(B454,12)=0,2,1))","v":"-"},{"$f":"IF(B454=\"-\",\"-\",F453*(1+CALCULOS!$C$27)+E454)","v":"-"},"-"]
[null,{"$f":"IF(OR(B454>=CALCULOS!$F$18,B454=\"-\"),\"-\",B454+1)","v":"-"},{"$f":"IF(B455=\"-\",\"-\",CALCULOS!$F$14+B455)","v":"-"},{"$f":"IF(B455=\"-\",\"-\",D454*(1+CALCULOS!$C$27))","v":"-"},{"$f":"IF(B455=\"-\",\"-\",IF(B455=1,CALCULOS!$C$47,IF(MOD(B454,12)=0,E453*(1+CALCULOS!$C$28),E454))*IF(MOD(B455,12)=0,2,1))","v":"-"},{"$f":"IF(B455=\"-\",\"-\",F454*(1+CALCULOS!$C$27)+E455)","v":"-"},"-"]
[null,{"$f":"IF(OR(B455>=CALCULOS!$F$18,B455=\"-\"),\"-\",B455+1)","v":"-"},{"$f":"IF(B456=\"-\",\"-\",CALCULOS!$F$14+B456)","v":"-"},{"$f":"IF(B456=\"-\",\"-\",D455*(1+CALCULOS!$C$27))","v":"-"},{"$f":"IF(B456=\"-\",\"-\",IF(B456=1,CALCULOS!$C$47,IF(MOD(B455,12)=0,E454*(1+CALCULOS!$C$28),E455))*IF(MOD(B456,12)=0,2,1))","v":"-"},{"$f":"IF(B456=\"-\",\"-\",F455*(1+CALCULOS!$C$27)+E456)","v":"-"},"-"]
[null,{"$f":"IF(OR(B456>=CALCULOS!$F$18,B456=\"-\"),\"-\",B456+1)","v":"-"},{"$f":"IF(B457=\"-\",\"-\",CALCULOS!$F$14+B457)","v":"-"},{"$f":"IF(B457=\"-\",\"-\",D456*(1+CALCULOS!$C$27))","v":"-"},{"$f":"IF(B457=\"-\",\"-\",IF(B457=1,CALCULOS!$C$47,IF(MOD(B456,12)=0,E455*(1+CALCULOS!$C$28),E456))*IF(MOD(B457,12)=0,2,1))","v":"-"},{"$f":"IF(B457=\"-\",\"-\",F456*(1+CALCULOS!$C$27)+E457)","v":"-"},"-"]
[null,{"$f":"IF(OR(B457>=CALCULOS!$F$18,B457=\"-\"),\"-\",B457+1)","v":"-"},{"$f":"IF(B458=\"-\",\"-\",CALCULOS!$F$14+B458)","v":"-"},{"$f":"IF(B458=\"-\",\"-\",D457*(1+CALCULOS!$C$27))","v":"-"},{"$f":"IF(B458=\"-\",\"-\",IF(B458=1,CALCULOS!$C$47,IF(MOD(B457,12)=0,E456*(1+CALCULOS!$C$28),E457))*IF(MOD(B458,12)=0,2,1))","v":"-"},{"$f":"IF(B458=\"-\",\"-\",F457*(1+CALCULOS!$C$27)+E458)","v":"-"},"-"]
[null,{"$f":"IF(OR(B458>=CALCULOS!$F$18,B458=\"-\"),\"-\",B458+1)","v":"-"},{"$f":"IF(B459=\"-\",\"-\",CALCULOS!$F$14+B459)","v":"-"},{"$f":"IF(B459=\"-\",\"-\",D458*(1+CALCULOS!$C$27))","v":"-"},{"$f":"IF(B459=\"-\",\"-\",IF(B459=1,CALCULOS!$C$47,IF(MOD(B458,12)=0,E457*(1+CALCULOS!$C$28),E458))*IF(MOD(B459,12)=0,2,1))","v":"-"},{"$f":"IF(B459=\"-\",\"-\",F458*(1+CALCULOS!$C$27)+E459)","v":"-"},"-"]
[null,{"$f":"IF(OR(B459>=CALCULOS!$F$18,B459=\"-\"),\"-\",B459+1)","v":"-"},{"$f":"IF(B460=\"-\",\"-\",CALCULOS!$F$14+B460)","v":"-"},{"$f":"IF(B460=\"-\",\"-\",D459*(1+CALCULOS!$C$27))","v":"-"},{"$f":"IF(B460=\"-\",\"-\",IF(B460=1,CALCULOS!$C$47,IF(MOD(B459,12)=0,E458*(1+CALCULOS!$C$28),E459))*IF(MOD(B460,12)=0,2,1))","v":"-"},{"$f":"IF(B460=\"-\",\"-\",F459*(1+CALCULOS!$C$27)+E460)","v":"-"},"-"]
[null,{"$f":"IF(OR(B460>=CALCULOS!$F$18,B460=\"-\"),\"-\",B460+1)","v":"-"},{"$f":"IF(B461=\"-\",\"-\",CALCULOS!$F$14+B461)","v":"-"},{"$f":"IF(B461=\"-\",\"-\",D460*(1+CALCULOS!$C$27))","v":"-"},{"$f":"IF(B461=\"-\",\"-\",IF(B461=1,CALCULOS!$C$47,IF(MOD(B460,12)=0,E459*(1+CALCULOS!$C$28),E460))*IF(MOD(B461,12)=0,2,1))","v":"-"},{"$f":"IF(B461=\"-\",\"-\",F460*(1+CALCULOS!$C$27)+E461)","v":"-"},"-"]
[null,{"$f":"IF(OR(B461>=CALCULOS!$F$18,B461=\"-\"),\"-\",B461+1)","v":"-"},{"$f":"IF(B462=\"-\",\"-\",CALCULOS!$F$14+B462)","v":"-"},{"$f":"IF(B462=\"-\",\"-\",D461*(1+CALCULOS!$C$27))","v":"-"},{"$f":"IF(B462=\"-\",\"-\",IF(B462=1,CALCULOS!$C$47,IF(MOD(B461,12)=0,E460*(1+CALCULOS!$C$28),E461))*IF(MOD(B462,12)=0,2,1))","v":"-"},{"$f":"IF(B462=\"-\",\"-\",F461*(1+CALCULOS!$C$27)+E462)","v":"-"},"-"]
[null,{"$f":"IF(OR(B462>=CALCULOS!$F$18,B462=\"-\"),\"-\",B462+1)","v":"-"},{"$f":"IF(B463=\"-\",\"-\",CALCULOS!$F$14+B463)","v":"-"},{"$f":"IF(B463=\"-\",\"-\",D462*(1+CALCULOS!$C$27))","v":"-"},{"$f":"IF(B463=\"-\",\"-\",IF(B463=1,CALCULOS!$C$47,IF(MOD(B462,12)=0,E461*(1+CALCULOS!$C$28),E462))*IF(MOD(B463,12)=0,2,1))","v":"-"},{"$f":"IF(B463=\"-\",\"-\",F462*(1+CALCULOS!$C$27)+E463)","v":"-"},"-"]
[null,{"$f":"IF(OR(B463>=CALCULOS!$F$18,B463=\"-\"),\"-\",B463+1)","v":"-"},{"$f":"IF(B464=\"-\",\"-\",CALCULOS!$F$14+B464)","v":"-"},{"$f":"IF(B464=\"-\",\"-\",D463*(1+CALCULOS!$C$27))","v":"-"},{"$f":"IF(B464=\"-\",\"-\",IF(B464=1,CALCULOS!$C$47,IF(MOD(B463,12)=0,E462*(1+CALCULOS!$C$28),E463))*IF(MOD(B464,12)=0,2,1))","v":"-"},{"$f":"IF(B464=\"-\",\"-\",F463*(1+CALCULOS!$C$27)+E464)","v":"-"},"-"]
[null,{"$f":"IF(OR(B464>=CALCULOS!$F$18,B464=\"-\"),\"-\",B464+1)","v":"-"},{"$f":"IF(B465=\"-\",\"-\",CALCULOS!$F$14+B465)","v":"-"},{"$f":"IF(B465=\"-\",\"-\",D464*(1+CALCULOS!$C$27))","v":"-"},{"$f":"IF(B465=\"-\",\"-\",IF(B465=1,CALCULOS!$C$47,IF(MOD(B464,12)=0,E463*(1+CALCULOS!$C$28),E464))*IF(MOD(B465,12)=0,2,1))","v":"-"},{"$f":"IF(B465=\"-\",\"-\",F464*(1+CALCULOS!$C$27)+E465)","v":"-"},"-"]
[null,{"$f":"IF(OR(B465>=CALCULOS!$F$18,B465=\"-\"),\"-\",B465+1)","v":"-"},{"$f":"IF(B466=\"-\",\"-\",CALCULOS!$F$14+B466)","v":"-"},{"$f":"IF(B466=\"-\",\"-\",D465*(1+CALCULOS!$C$27))","v":"-"},{"$f":"IF(B466=\"-\",\"-\",IF(B466=1,CALCULOS!$C$47,IF(MOD(B465,12)=0,E464*(1+CALCULOS!$C$28),E465))*IF(MOD(B466,12)=0,2,1))","v":"-"},{"$f":"IF(B466=\"-\",\"-\",F465*(1+CALCULOS!$C$27)+E466)","v":"-"},"-"]
[null,{"$f":"IF(OR(B466>=CALCULOS!$F$18,B466=\"-\"),\"-\",B466+1)","v":"-"},{"$f":"IF(B467=\"-\",\"-\",CALCULOS!$F$14+B467)","v":"-"},{"$f":"IF(B467=\"-\",\"-\",D466*(1+CALCULOS!$C$27))","v":"-"},{"$f":"IF(B467=\"-\",\"-\",IF(B467=1,CALCULOS!$C$47,IF(MOD(B466,12)=0,E465*(1+CALCULOS!$C$28),E466))*IF(MOD(B467,12)=0,2,1))","v":"-"},{"$f":"IF(B467=\"-\",\"-\",F466*(1+CALCULOS!$C$27)+E467)","v":"-"},"-"]
[null,{"$f":"IF(OR(B467>=CALCULOS!$F$18,B467=\"-\"),\"-\",B467+1)","v":"-"},{"$f":"IF(B468=\"-\",\"-\",CALCULOS!$F$14+B468)","v":"-"},{"$f":"IF(B468=\"-\",\"-\",D467*(1+CALCULOS!$C$27))","v":"-"},{"$f":"IF(B468=\"-\",\"-\",IF(B468=1,CALCULOS!$C$47,IF(MOD(B467,12)=0,E466*(1+CALCULOS!$C$28),E467))*IF(MOD(B468,12)=0,2,1))","v":"-"},{"$f":"IF(B468=\"-\",\"-\",F467*(1+CALCULOS!$C$27)+E468)","v":"-"},"-"]
[null,{"$f":"IF(OR(B468>=CALCULOS!$F$18,B468=\"-\"),\"-\",B468+1)","v":"-"},{"$f":"IF(B469=\"-\",\"-\",CALCULOS!$F$14+B469)","v":"-"},{"$f":"IF(B469=\"-\",\"-\",D468*(1+CALCULOS!$C$27))","v":"-"},{"$f":"IF(B469=\"-\",\"-\",IF(B469=1,CALCULOS!$C$47,IF(MOD(B468,12)=0,E467*(1+CALCULOS!$C$28),E468))*IF(MOD(B469,12)=0,2,1))","v":"-"},{"$f":"IF(B469=\"-\",\"-\",F468*(1+CALCULOS!$C$27)+E469)","v":"-"},"-"]
[null,{"$f":"IF(OR(B469>=CALCULOS!$F$18,B469=\"-\"),\"-\",B469+1)","v":"-"},{"$f":"IF(B470=\"-\",\"-\",CALCULOS!$F$14+B470)","v":"-"},{"$f":"IF(B470=\"-\",\"-\",D469*(1+CALCULOS!$C$27))","v":"-"},{"$f":"IF(B470=\"-\",\"-\",IF(B470=1,CALCULOS!$C$47,IF(MOD(B469,12)=0,E468*(1+CALCULOS!$C$28),E469))*IF(MOD(B470,12)=0,2,1))","v":"-"},{"$f":"IF(B470=\"-\",\"-\",F469*(1+CALCULOS!$C$27)+E470)","v":"-"},"-"]
[null,{"$f":"IF(OR(B470>=CALCULOS!$F$18,B470=\"-\"),\"-\",B470+1)","v":"-"},{"$f":"IF(B471=\"-\",\"-\",CALCULOS!$F$14+B471)","v":"-"},{"$f":"IF(B471=\"-\",\"-\",D470*(1+CALCULOS!$C$27))","v":"-"},{"$f":"IF(B471=\"-\",\"-\",IF(B471=1,CALCULOS!$C$47,IF(MOD(B470,12)=0,E469*(1+CALCULOS!$C$28),E470))*IF(MOD(B471,12)=0,2,1))","v":"-"},{"$f":"IF(B471=\"-\",\"-\",F470*(1+CALCULOS!$C$27)+E471)","v":"-"},"-"]
[null,{"$f":"IF(OR(B471>=CALCULOS!$F$18,B471=\"-\"),\"-\",B471+1)","v":"-"},{"$f":"IF(B472=\"-\",\"-\",CALCULOS!$F$14+B472)","v":"-"},{"$f":"IF(B472=\"-\",\"-\",D471*(1+CALCULOS!$C$27))","v":"-"},{"$f":"IF(B472=\"-\",\"-\",IF(B472=1,CALCULOS!$C$47,IF(MOD(B471,12)=0,E470*(1+CALCULOS!$C$28),E471))*IF(MOD(B472,12)=0,2,1))","v":"-"},{"$f":"IF(B472=\"-\",\"-\",F471*(1+CALCULOS!$C$27)+E472)","v":"-"},"-"]
[null,{"$f":"IF(OR(B472>=CALCULOS!$F$18,B472=\"-\"),\"-\",B472+1)","v":"-"},{"$f":"IF(B473=\"-\",\"-\",CALCULOS!$F$14+B473)","v":"-"},{"$f":"IF(B473=\"-\",\"-\",D472*(1+CALCULOS!$C$27))","v":"-"},{"$f":"IF(B473=\"-\",\"-\",IF(B473=1,CALCULOS!$C$47,IF(MOD(B472,12)=0,E471*(1+CALCULOS!$C$28),E472))*IF(MOD(B473,12)=0,2,1))","v":"-"},{"$f":"IF(B473=\"-\",\"-\",F472*(1+CALCULOS!$C$27)+E473)","v":"-"},{"$f":"IF(B473=\"-\",\"-\",SUM(D473,F473))","v":"-"}]
[null,{"$f":"IF(OR(B473>=CALCULOS!$F$18,B473=\"-\"),\"-\",B473+1)","v":"-"},{"$f":"IF(B474=\"-\",\"-\",CALCULOS!$F$14+B474)","v":"-"},{"$f":"IF(B474=\"-\",\"-\",D473*(1+CALCULOS!$C$27))","v":"-"},{"$f":"IF(B474=\"-\",\"-\",IF(B474=1,CALCULOS!$C$47,IF(MOD(B473,12)=0,E472*(1+CALCULOS!$C$28),E473))*IF(MOD(B474,12)=0,2,1))","v":"-"},{"$f":"IF(B474=\"-\",\"-\",F473*(1+CALCULOS!$C$27)+E474)","v":"-"},"-"]
[null,{"$f":"IF(OR(B474>=CALCULOS!$F$18,B474=\"-\"),\"-\",B474+1)","v":"-"},{"$f":"IF(B475=\"-\",\"-\",CALCULOS!$F$14+B475)","v":"-"},{"$f":"IF(B475=\"-\",\"-\",D474*(1+CALCULOS!$C$27))","v":"-"},{"$f":"IF(B475=\"-\",\"-\",IF(B475=1,CALCULOS!$C$47,IF(MOD(B474,12)=0,E473*(1+CALCULOS!$C$28),E474))*IF(MOD(B475,12)=0,2,1))","v":"-"},{"$f":"IF(B475=\"-\",\"-\",F474*(1+CALCULOS!$C$27)+E475)","v":"-"},"-"]
[null,{"$f":"IF(OR(B475>=CALCULOS!$F$18,B475=\"-\"),\"-\",B475+1)","v":"-"},{"$f":"IF(B476=\"-\",\"-\",CALCULOS!$F$14+B476)","v":"-"},{"$f":"IF(B476=\"-\",\"-\",D475*(1+CALCULOS!$C$27))","v":"-"},{"$f":"IF(B476=\"-\",\"-\",IF(B476=1,CALCULOS!$C$47,IF(MOD(B475,12)=0,E474*(1+CALCULOS!$C$28),E475))*IF(MOD(B476,12)=0,2,1))","v":"-"},{"$f":"IF(B476=\"-\",\"-\",F475*(1+CALCULOS!$C$27)+E476)","v":"-"},"-"]
[null,{"$f":"IF(OR(B476>=CALCULOS!$F$18,B476=\"-\"),\"-\",B476+1)","v":"-"},{"$f":"IF(B477=\"-\",\"-\",CALCULOS!$F$14+B477)","v":"-"},{"$f":"IF(B477=\"-\",\"-\",D476*(1+CALCULOS!$C$27))","v":"-"},{"$f":"IF(B477=\"-\",\"-\",IF(B477=1,CALCULOS!$C$47,IF(MOD(B476,12)=0,E475*(1+CALCULOS!$C$28),E476))*IF(MOD(B477,12)=0,2,1))","v":"-"},{"$f":"IF(B477=\"-\",\"-\",F476*(1+CALCULOS!$C$27)+E477)","v":"-"},"-"]
[null,{"$f":"IF(OR(B477>=CALCULOS!$F$18,B477=\"-\"),\"-\",B477+1)","v":"-"},{"$f":"IF(B478=\"-\",\"-\",CALCULOS!$F$14+B478)","v":"-"},{"$f":"IF(B478=\"-\",\"-\",D477*(1+CALCULOS!$C$27))","v":"-"},{"$f":"IF(B478=\"-\",\"-\",IF(B478=1,CALCULOS!$C$47,IF(MOD(B477,12)=0,E476*(1+CALCULOS!$C$28),E477))*IF(MOD(B478,12)=0,2,1))","v":"-"},{"$f":"IF(B478=\"-\",\"-\",F477*(1+CALCULOS!$C$27)+E478)","v":"-"},"-"]
[null,{"$f":"IF(OR(B478>=CALCULOS!$F$18,B478=\"-\"),\"-\",B478+1)","v":"-"},{"$f":"IF(B479=\"-\",\"-\",CALCULOS!$F$14+B479)","v":"-"},{"$f":"IF(B479=\"-\",\"-\",D478*(1+CALCULOS!$C$27))","v":"-"},{"$f":"IF(B479=\"-\",\"-\",IF(B479=1,CALCULOS!$C$47,IF(MOD(B478,12)=0,E477*(1+CALCULOS!$C$28),E478))*IF(MOD(B479,12)=0,2,1))","v":"-"},{"$f":"IF(B479=\"-\",\"-\",F478*(1+CALCULOS!$C$27)+E479)","v":"-"},"-"]
[null,{"$f":"IF(OR(B479>=CALCULOS!$F$18,B479=\"-\"),\"-\",B479+1)","v":"-"},{"$f":"IF(B480=\"-\",\"-\",CALCULOS!$F$14+B480)","v":"-"},{"$f":"IF(B480=\"-\",\"-\",D479*(1+CALCULOS!$C$27))","v":"-"},{"$f":"IF(B480=\"-\",\"-\",IF(B480=1,CALCULOS!$C$47,IF(MOD(B479,12)=0,E478*(1+CALCULOS!$C$28),E479))*IF(MOD(B480,12)=0,2,1))","v":"-"},{"$f":"IF(B480=\"-\",\"-\",F479*(1+CALCULOS!$C$27)+E480)","v":"-"},"-"]
[null,{"$f":"IF(OR(B480>=CALCULOS!$F$18,B480=\"-\"),\"-\",B480+1)","v":"-"},{"$f":"IF(B481=\"-\",\"-\",CALCULOS!$F$14+B481)","v":"-"},{"$f":"IF(B481=\"-\",\"-\",D480*(1+CALCULOS!$C$27))","v":"-"},{"$f":"IF(B481=\"-\",\"-\",IF(B481=1,CALCULOS!$C$47,IF(MOD(B480,12)=0,E479*(1+CALCULOS!$C$28),E480))*IF(MOD(B481,12)=0,2,1))","v":"-"},{"$f":"IF(B481=\"-\",\"-\",F480*(1+CALCULOS!$C$27)+E481)","v":"-"},"-"]
[null,{"$f":"IF(OR(B481>=CALCULOS!$F$18,B481=\"-\"),\"-\",B481+1)","v":"-"},{"$f":"IF(B482=\"-\",\"-\",CALCULOS!$F$14+B482)","v":"-"},{"$f":"IF(B482=\"-\",\"-\",D481*(1+CALCULOS!$C$27))","v":"-"},{"$f":"IF(B482=\"-\",\"-\",IF(B482=1,CALCULOS!$C$47,IF(MOD(B481,12)=0,E480*(1+CALCULOS!$C$28),E481))*IF(MOD(B482,12)=0,2,1))","v":"-"},{"$f":"IF(B482=\"-\",\"-\",F481*(1+CALCULOS!$C$27)+E482)","v":"-"},"-"]
[null,{"$f":"IF(OR(B482>=CALCULOS!$F$18,B482=\"-\"),\"-\",B482+1)","v":"-"},{"$f":"IF(B483=\"-\",\"-\",CALCULOS!$F$14+B483)","v":"-"},{"$f":"IF(B483=\"-\",\"-\",D482*(1+CALCULOS!$C$27))","v":"-"},{"$f":"IF(B483=\"-\",\"-\",IF(B483=1,CALCULOS!$C$47,IF(MOD(B482,12)=0,E481*(1+CALCULOS!$C$28),E482))*IF(MOD(B483,12)=0,2,1))","v":"-"},{"$f":"IF(B483=\"-\",\"-\",F482*(1+CALCULOS!$C$27)+E483)","v":"-"},"-"]
[null,{"$f":"IF(OR(B483>=CALCULOS!$F$18,B483=\"-\"),\"-\",B483+1)","v":"-"},{"$f":"IF(B484=\"-\",\"-\",CALCULOS!$F$14+B484)","v":"-"},{"$f":"IF(B484=\"-\",\"-\",D483*(1+CALCULOS!$C$27))","v":"-"},{"$f":"IF(B484=\"-\",\"-\",IF(B484=1,CALCULOS!$C$47,IF(MOD(B483,12)=0,E482*(1+CALCULOS!$C$28),E483))*IF(MOD(B484,12)=0,2,1))","v":"-"},{"$f":"IF(B484=\"-\",\"-\",F483*(1+CALCULOS!$C$27)+E484)","v":"-"},"-"]
[null,{"$f":"IF(OR(B484>=CALCULOS!$F$18,B484=\"-\"),\"-\",B484+1)","v":"-"},{"$f":"IF(B485=\"-\",\"-\",CALCULOS!$F$14+B485)","v":"-"},{"$f":"IF(B485=\"-\",\"-\",D484*(1+CALCULOS!$C$27))","v":"-"},{"$f":"IF(B485=\"-\",\"-\",IF(B485=1,CALCULOS!$C$47,IF(MOD(B484,12)=0,E483*(1+CALCULOS!$C$28),E484))*IF(MOD(B485,12)=0,2,1))","v":"-"},{"$f":"IF(B485=\"-\",\"-\",F484*(1+CALCULOS!$C$27)+E485)","v":"-"},"-"]
[null,{"$f":"IF(OR(B485>=CALCULOS!$F$18,B485=\"-\"),\"-\",B485+1)","v":"-"},{"$f":"IF(B486=\"-\",\"-\",CALCULOS!$F$14+B486)","v":"-"},{"$f":"IF(B486=\"-\",\"-\",D485*(1+CALCULOS!$C$27))","v":"-"},{"$f":"IF(B486=\"-\",\"-\",IF(B486=1,CALCULOS!$C$47,IF(MOD(B485,12)=0,E484*(1+CALCULOS!$C$28),E485))*IF(MOD(B486,12)=0,2,1))","v":"-"},{"$f":"IF(B486=\"-\",\"-\",F485*(1+CALCULOS!$C$27)+E486)","v":"-"},"-"]
[null,{"$f":"IF(OR(B486>=CALCULOS!$F$18,B486=\"-\"),\"-\",B486+1)","v":"-"},{"$f":"IF(B487=\"-\",\"-\",CALCULOS!$F$14+B487)","v":"-"},{"$f":"IF(B487=\"-\",\"-\",D486*(1+CALCULOS!$C$27))","v":"-"},{"$f":"IF(B487=\"-\",\"-\",IF(B487=1,CALCULOS!$C$47,IF(MOD(B486,12)=0,E485*(1+CALCULOS!$C$28),E486))*IF(MOD(B487,12)=0,2,1))","v":"-"},{"$f":"IF(B487=\"-\",\"-\",F486*(1+CALCULOS!$C$27)+E487)","v":"-"},"-"]
[null,{"$f":"IF(OR(B487>=CALCULOS!$F$18,B487=\"-\"),\"-\",B487+1)","v":"-"},{"$f":"IF(B488=\"-\",\"-\",CALCULOS!$F$14+B488)","v":"-"},{"$f":"IF(B488=\"-\",\"-\",D487*(1+CALCULOS!$C$27))","v":"-"},{"$f":"IF(B488=\"-\",\"-\",IF(B488=1,CALCULOS!$C$47,IF(MOD(B487,12)=0,E486*(1+CALCULOS!$C$28),E487))*IF(MOD(B488,12)=0,2,1))","v":"-"},{"$f":"IF(B488=\"-\",\"-\",F487*(1+CALCULOS!$C$27)+E488)","v":"-"},"-"]
[null,{"$f":"IF(OR(B488>=CALCULOS!$F$18,B488=\"-\"),\"-\",B488+1)","v":"-"},{"$f":"IF(B489=\"-\",\"-\",CALCULOS!$F$14+B489)","v":"-"},{"$f":"IF(B489=\"-\",\"-\",D488*(1+CALCULOS!$C$27))","v":"-"},{"$f":"IF(B489=\"-\",\"-\",IF(B489=1,CALCULOS!$C$47,IF(MOD(B488,12)=0,E487*(1+CALCULOS!$C$28),E488))*IF(MOD(B489,12)=0,2,1))","v":"-"},{"$f":"IF(B489=\"-\",\"-\",F488*(1+CALCULOS!$C$27)+E489)","v":"-"},"-"]
[null,{"$f":"IF(OR(B489>=CALCULOS!$F$18,B489=\"-\"),\"-\",B489+1)","v":"-"},{"$f":"IF(B490=\"-\",\"-\",CALCULOS!$F$14+B490)","v":"-"},{"$f":"IF(B490=\"-\",\"-\",D489*(1+CALCULOS!$C$27))","v":"-"},{"$f":"IF(B490=\"-\",\"-\",IF(B490=1,CALCULOS!$C$47,IF(MOD(B489,12)=0,E488*(1+CALCULOS!$C$28),E489))*IF(MOD(B490,12)=0,2,1))","v":"-"},{"$f":"IF(B490=\"-\",\"-\",F489*(1+CALCULOS!$C$27)+E490)","v":"-"},"-"]
[null,{"$f":"IF(OR(B490>=CALCULOS!$F$18,B490=\"-\"),\"-\",B490+1)","v":"-"},{"$f":"IF(B491=\"-\",\"-\",CALCULOS!$F$14+B491)","v":"-"},{"$f":"IF(B491=\"-\",\"-\",D490*(1+CALCULOS!$C$27))","v":"-"},{"$f":"IF(B491=\"-\",\"-\",IF(B491=1,CALCULOS!$C$47,IF(MOD(B490,12)=0,E489*(1+CALCULOS!$C$28),E490))*IF(MOD(B491,12)=0,2,1))","v":"-"},{"$f":"IF(B491=\"-\",\"-\",F490*(1+CALCULOS!$C$27)+E491)","v":"-"},"-"]
[null,{"$f":"IF(OR(B491>=CALCULOS!$F$18,B491=\"-\"),\"-\",B491+1)","v":"-"},{"$f":"IF(B492=\"-\",\"-\",CALCULOS!$F$14+B492)","v":"-"},{"$f":"IF(B492=\"-\",\"-\",D491*(1+CALCULOS!$C$27))","v":"-"},{"$f":"IF(B492=\"-\",\"-\",IF(B492=1,CALCULOS!$C$47,IF(MOD(B491,12)=0,E490*(1+CALCULOS!$C$28),E491))*IF(MOD(B492,12)=0,2,1))","v":"-"},{"$f":"IF(B492=\"-\",\"-\",F491*(1+CALCULOS!$C$27)+E492)","v":"-"},"-"]
[null,{"$f":"IF(OR(B492>=CALCULOS!$F$18,B492=\"-\"),\"-\",B492+1)","v":"-"},{"$f":"IF(B493=\"-\",\"-\",CALCULOS!$F$14+B493)","v":"-"},{"$f":"IF(B493=\"-\",\"-\",D492*(1+CALCULOS!$C$27))","v":"-"},{"$f":"IF(B493=\"-\",\"-\",IF(B493=1,CALCULOS!$C$47,IF(MOD(B492,12)=0,E491*(1+CALCULOS!$C$28),E492))*IF(MOD(B493,12)=0,2,1))","v":"-"},{"$f":"IF(B493=\"-\",\"-\",F492*(1+CALCULOS!$C$27)+E493)","v":"-"},"-"]
[null,{"$f":"IF(OR(B493>=CALCULOS!$F$18,B493=\"-\"),\"-\",B493+1)","v":"-"},{"$f":"IF(B494=\"-\",\"-\",CALCULOS!$F$14+B494)","v":"-"},{"$f":"IF(B494=\"-\",\"-\",D493*(1+CALCULOS!$C$27))","v":"-"},{"$f":"IF(B494=\"-\",\"-\",IF(B494=1,CALCULOS!$C$47,IF(MOD(B493,12)=0,E492*(1+CALCULOS!$C$28),E493))*IF(MOD(B494,12)=0,2,1))","v":"-"},{"$f":"IF(B494=\"-\",\"-\",F493*(1+CALCULOS!$C$27)+E494)","v":"-"},"-"]
[null,{"$f":"IF(OR(B494>=CALCULOS!$F$18,B494=\"-\"),\"-\",B494+1)","v":"-"},{"$f":"IF(B495=\"-\",\"-\",CALCULOS!$F$14+B495)","v":"-"},{"$f":"IF(B495=\"-\",\"-\",D494*(1+CALCULOS!$C$27))","v":"-"},{"$f":"IF(B495=\"-\",\"-\",IF(B495=1,CALCULOS!$C$47,IF(MOD(B494,12)=0,E493*(1+CALCULOS!$C$28),E494))*IF(MOD(B495,12)=0,2,1))","v":"-"},{"$f":"IF(B495=\"-\",\"-\",F494*(1+CALCULOS!$C$27)+E495)","v":"-"},"-"]
[null,{"$f":"IF(OR(B495>=CALCULOS!$F$18,B495=\"-\"),\"-\",B495+1)","v":"-"},{"$f":"IF(B496=\"-\",\"-\",CALCULOS!$F$14+B496)","v":"-"},{"$f":"IF(B496=\"-\",\"-\",D495*(1+CALCULOS!$C$27))","v":"-"},{"$f":"IF(B496=\"-\",\"-\",IF(B496=1,CALCULOS!$C$47,IF(MOD(B495,12)=0,E494*(1+CALCULOS!$C$28),E495))*IF(MOD(B496,12)=0,2,1))","v":"-"},{"$f":"IF(B496=\"-\",\"-\",F495*(1+CALCULOS!$C$27)+E496)","v":"-"},"-"]
[null,{"$f":"IF(OR(B496>=CALCULOS!$F$18,B496=\"-\"),\"-\",B496+1)","v":"-"},{"$f":"IF(B497=\"-\",\"-\",CALCULOS!$F$14+B497)","v":"-"},{"$f":"IF(B497=\"-\",\"-\",D496*(1+CALCULOS!$C$27))","v":"-"},{"$f":"IF(B497=\"-\",\"-\",IF(B497=1,CALCULOS!$C$47,IF(MOD(B496,12)=0,E495*(1+CALCULOS!$C$28),E496))*IF(MOD(B497,12)=0,2,1))","v":"-"},{"$f":"IF(B497=\"-\",\"-\",F496*(1+CALCULOS!$C$27)+E497)","v":"-"},"-"]
[null,{"$f":"IF(OR(B497>=CALCULOS!$F$18,B497=\"-\"),\"-\",B497+1)","v":"-"},{"$f":"IF(B498=\"-\",\"-\",CALCULOS!$F$14+B498)","v":"-"},{"$f":"IF(B498=\"-\",\"-\",D497*(1+CALCULOS!$C$27))","v":"-"},{"$f":"IF(B498=\"-\",\"-\",IF(B498=1,CALCULOS!$C$47,IF(MOD(B497,12)=0,E496*(1+CALCULOS!$C$28),E497))*IF(MOD(B498,12)=0,2,1))","v":"-"},{"$f":"IF(B498=\"-\",\"-\",F497*(1+CALCULOS!$C$27)+E498)","v":"-"},"-"]
[null,{"$f":"IF(OR(B498>=CALCULOS!$F$18,B498=\"-\"),\"-\",B498+1)","v":"-"},{"$f":"IF(B499=\"-\",\"-\",CALCULOS!$F$14+B499)","v":"-"},{"$f":"IF(B499=\"-\",\"-\",D498*(1+CALCULOS!$C$27))","v":"-"},{"$f":"IF(B499=\"-\",\"-\",IF(B499=1,CALCULOS!$C$47,IF(MOD(B498,12)=0,E497*(1+CALCULOS!$C$28),E498))*IF(MOD(B499,12)=0,2,1))","v":"-"},{"$f":"IF(B499=\"-\",\"-\",F498*(1+CALCULOS!$C$27)+E499)","v":"-"},"-"]
[null,{"$f":"IF(OR(B499>=CALCULOS!$F$18,B499=\"-\"),\"-\",B499+1)","v":"-"},{"$f":"IF(B500=\"-\",\"-\",CALCULOS!$F$14+B500)","v":"-"},{"$f":"IF(B500=\"-\",\"-\",D499*(1+CALCULOS!$C$27))","v":"-"},{"$f":"IF(B500=\"-\",\"-\",IF(B500=1,CALCULOS!$C$47,IF(MOD(B499,12)=0,E498*(1+CALCULOS!$C$28),E499))*IF(MOD(B500,12)=0,2,1))","v":"-"},{"$f":"IF(B500=\"-\",\"-\",F499*(1+CALCULOS!$C$27)+E500)","v":"-"},"-"]
[null,{"$f":"IF(OR(B500>=CALCULOS!$F$18,B500=\"-\"),\"-\",B500+1)","v":"-"},{"$f":"IF(B501=\"-\",\"-\",CALCULOS!$F$14+B501)","v":"-"},{"$f":"IF(B501=\"-\",\"-\",D500*(1+CALCULOS!$C$27))","v":"-"},{"$f":"IF(B501=\"-\",\"-\",IF(B501=1,CALCULOS!$C$47,IF(MOD(B500,12)=0,E499*(1+CALCULOS!$C$28),E500))*IF(MOD(B501,12)=0,2,1))","v":"-"},{"$f":"IF(B501=\"-\",\"-\",F500*(1+CALCULOS!$C$27)+E501)","v":"-"},"-"]
[null,{"$f":"IF(OR(B501>=CALCULOS!$F$18,B501=\"-\"),\"-\",B501+1)","v":"-"},{"$f":"IF(B502=\"-\",\"-\",CALCULOS!$F$14+B502)","v":"-"},{"$f":"IF(B502=\"-\",\"-\",D501*(1+CALCULOS!$C$27))","v":"-"},{"$f":"IF(B502=\"-\",\"-\",IF(B502=1,CALCULOS!$C$47,IF(MOD(B501,12)=0,E500*(1+CALCULOS!$C$28),E501))*IF(MOD(B502,12)=0,2,1))","v":"-"},{"$f":"IF(B502=\"-\",\"-\",F501*(1+CALCULOS!$C$27)+E502)","v":"-"},"-"]
[null,{"$f":"IF(OR(B502>=CALCULOS!$F$18,B502=\"-\"),\"-\",B502+1)","v":"-"},{"$f":"IF(B503=\"-\",\"-\",CALCULOS!$F$14+B503)","v":"-"},{"$f":"IF(B503=\"-\",\"-\",D502*(1+CALCULOS!$C$27))","v":"-"},{"$f":"IF(B503=\"-\",\"-\",IF(B503=1,CALCULOS!$C$47,IF(MOD(B502,12)=0,E501*(1+CALCULOS!$C$28),E502))*IF(MOD(B503,12)=0,2,1))","v":"-"},{"$f":"IF(B503=\"-\",\"-\",F502*(1+CALCULOS!$C$27)+E503)","v":"-"},"-"]
[null,{"$f":"IF(OR(B503>=CALCULOS!$F$18,B503=\"-\"),\"-\",B503+1)","v":"-"},{"$f":"IF(B504=\"-\",\"-\",CALCULOS!$F$14+B504)","v":"-"},{"$f":"IF(B504=\"-\",\"-\",D503*(1+CALCULOS!$C$27))","v":"-"},{"$f":"IF(B504=\"-\",\"-\",IF(B504=1,CALCULOS!$C$47,IF(MOD(B503,12)=0,E502*(1+CALCULOS!$C$28),E503))*IF(MOD(B504,12)=0,2,1))","v":"-"},{"$f":"IF(B504=\"-\",\"-\",F503*(1+CALCULOS!$C$27)+E504)","v":"-"},"-"]
[null,{"$f":"IF(OR(B504>=CALCULOS!$F$18,B504=\"-\"),\"-\",B504+1)","v":"-"},{"$f":"IF(B505=\"-\",\"-\",CALCULOS!$F$14+B505)","v":"-"},{"$f":"IF(B505=\"-\",\"-\",D504*(1+CALCULOS!$C$27))","v":"-"},{"$f":"IF(B505=\"-\",\"-\",IF(B505=1,CALCULOS!$C$47,IF(MOD(B504,12)=0,E503*(1+CALCULOS!$C$28),E504))*IF(MOD(B505,12)=0,2,1))","v":"-"},{"$f":"IF(B505=\"-\",\"-\",F504*(1+CALCULOS!$C$27)+E505)","v":"-"},"-"]
[null,{"$f":"IF(OR(B505>=CALCULOS!$F$18,B505=\"-\"),\"-\",B505+1)","v":"-"},{"$f":"IF(B506=\"-\",\"-\",CALCULOS!$F$14+B506)","v":"-"},{"$f":"IF(B506=\"-\",\"-\",D505*(1+CALCULOS!$C$27))","v":"-"},{"$f":"IF(B506=\"-\",\"-\",IF(B506=1,CALCULOS!$C$47,IF(MOD(B505,12)=0,E504*(1+CALCULOS!$C$28),E505))*IF(MOD(B506,12)=0,2,1))","v":"-"},{"$f":"IF(B506=\"-\",\"-\",F505*(1+CALCULOS!$C$27)+E506)","v":"-"},"-"]
[null,{"$f":"IF(OR(B506>=CALCULOS!$F$18,B506=\"-\"),\"-\",B506+1)","v":"-"},{"$f":"IF(B507=\"-\",\"-\",CALCULOS!$F$14+B507)","v":"-"},{"$f":"IF(B507=\"-\",\"-\",D506*(1+CALCULOS!$C$27))","v":"-"},{"$f":"IF(B507=\"-\",\"-\",IF(B507=1,CALCULOS!$C$47,IF(MOD(B506,12)=0,E505*(1+CALCULOS!$C$28),E506))*IF(MOD(B507,12)=0,2,1))","v":"-"},{"$f":"IF(B507=\"-\",\"-\",F506*(1+CALCULOS!$C$27)+E507)","v":"-"},"-"]
[null,{"$f":"IF(OR(B507>=CALCULOS!$F$18,B507=\"-\"),\"-\",B507+1)","v":"-"},{"$f":"IF(B508=\"-\",\"-\",CALCULOS!$F$14+B508)","v":"-"},{"$f":"IF(B508=\"-\",\"-\",D507*(1+CALCULOS!$C$27))","v":"-"},{"$f":"IF(B508=\"-\",\"-\",IF(B508=1,CALCULOS!$C$47,IF(MOD(B507,12)=0,E506*(1+CALCULOS!$C$28),E507))*IF(MOD(B508,12)=0,2,1))","v":"-"},{"$f":"IF(B508=\"-\",\"-\",F507*(1+CALCULOS!$C$27)+E508)","v":"-"},"-"]
[null,{"$f":"IF(OR(B508>=CALCULOS!$F$18,B508=\"-\"),\"-\",B508+1)","v":"-"},{"$f":"IF(B509=\"-\",\"-\",CALCULOS!$F$14+B509)","v":"-"},{"$f":"IF(B509=\"-\",\"-\",D508*(1+CALCULOS!$C$27))","v":"-"},{"$f":"IF(B509=\"-\",\"-\",IF(B509=1,CALCULOS!$C$47,IF(MOD(B508,12)=0,E507*(1+CALCULOS!$C$28),E508))*IF(MOD(B509,12)=0,2,1))","v":"-"},{"$f":"IF(B509=\"-\",\"-\",F508*(1+CALCULOS!$C$27)+E509)","v":"-"},"-"]
[null,{"$f":"IF(OR(B509>=CALCULOS!$F$18,B509=\"-\"),\"-\",B509+1)","v":"-"},{"$f":"IF(B510=\"-\",\"-\",CALCULOS!$F$14+B510)","v":"-"},{"$f":"IF(B510=\"-\",\"-\",D509*(1+CALCULOS!$C$27))","v":"-"},{"$f":"IF(B510=\"-\",\"-\",IF(B510=1,CALCULOS!$C$47,IF(MOD(B509,12)=0,E508*(1+CALCULOS!$C$28),E509))*IF(MOD(B510,12)=0,2,1))","v":"-"},{"$f":"IF(B510=\"-\",\"-\",F509*(1+CALCULOS!$C$27)+E510)","v":"-"},"-"]
[null,{"$f":"IF(OR(B510>=CALCULOS!$F$18,B510=\"-\"),\"-\",B510+1)","v":"-"},{"$f":"IF(B511=\"-\",\"-\",CALCULOS!$F$14+B511)","v":"-"},{"$f":"IF(B511=\"-\",\"-\",D510*(1+CALCULOS!$C$27))","v":"-"},{"$f":"IF(B511=\"-\",\"-\",IF(B511=1,CALCULOS!$C$47,IF(MOD(B510,12)=0,E509*(1+CALCULOS!$C$28),E510))*IF(MOD(B511,12)=0,2,1))","v":"-"},{"$f":"IF(B511=\"-\",\"-\",F510*(1+CALCULOS!$C$27)+E511)","v":"-"},"-"]
[null,{"$f":"IF(OR(B511>=CALCULOS!$F$18,B511=\"-\"),\"-\",B511+1)","v":"-"},{"$f":"IF(B512=\"-\",\"-\",CALCULOS!$F$14+B512)","v":"-"},{"$f":"IF(B512=\"-\",\"-\",D511*(1+CALCULOS!$C$27))","v":"-"},{"$f":"IF(B512=\"-\",\"-\",IF(B512=1,CALCULOS!$C$47,IF(MOD(B511,12)=0,E510*(1+CALCULOS!$C$28),E511))*IF(MOD(B512,12)=0,2,1))","v":"-"},{"$f":"IF(B512=\"-\",\"-\",F511*(1+CALCULOS!$C$27)+E512)","v":"-"},"-"]
[null,{"$f":"IF(OR(B512>=CALCULOS!$F$18,B512=\"-\"),\"-\",B512+1)","v":"-"},{"$f":"IF(B513=\"-\",\"-\",CALCULOS!$F$14+B513)","v":"-"},{"$f":"IF(B513=\"-\",\"-\",D512*(1+CALCULOS!$C$27))","v":"-"},{"$f":"IF(B513=\"-\",\"-\",IF(B513=1,CALCULOS!$C$47,IF(MOD(B512,12)=0,E511*(1+CALCULOS!$C$28),E512))*IF(MOD(B513,12)=0,2,1))","v":"-"},{"$f":"IF(B513=\"-\",\"-\",F512*(1+CALCULOS!$C$27)+E513)","v":"-"},"-"]
[null,{"$f":"IF(OR(B513>=CALCULOS!$F$18,B513=\"-\"),\"-\",B513+1)","v":"-"},{"$f":"IF(B514=\"-\",\"-\",CALCULOS!$F$14+B514)","v":"-"},{"$f":"IF(B514=\"-\",\"-\",D513*(1+CALCULOS!$C$27))","v":"-"},{"$f":"IF(B514=\"-\",\"-\",IF(B514=1,CALCULOS!$C$47,IF(MOD(B513,12)=0,E512*(1+CALCULOS!$C$28),E513))*IF(MOD(B514,12)=0,2,1))","v":"-"},{"$f":"IF(B514=\"-\",\"-\",F513*(1+CALCULOS!$C$27)+E514)","v":"-"},"-"]
[null,{"$f":"IF(OR(B514>=CALCULOS!$F$18,B514=\"-\"),\"-\",B514+1)","v":"-"},{"$f":"IF(B515=\"-\",\"-\",CALCULOS!$F$14+B515)","v":"-"},{"$f":"IF(B515=\"-\",\"-\",D514*(1+CALCULOS!$C$27))","v":"-"},{"$f":"IF(B515=\"-\",\"-\",IF(B515=1,CALCULOS!$C$47,IF(MOD(B514,12)=0,E513*(1+CALCULOS!$C$28),E514))*IF(MOD(B515,12)=0,2,1))","v":"-"},{"$f":"IF(B515=\"-\",\"-\",F514*(1+CALCULOS!$C$27)+E515)","v":"-"},"-"]
[null,{"$f":"IF(OR(B515>=CALCULOS!$F$18,B515=\"-\"),\"-\",B515+1)","v":"-"},{"$f":"IF(B516=\"-\",\"-\",CALCULOS!$F$14+B516)","v":"-"},{"$f":"IF(B516=\"-\",\"-\",D515*(1+CALCULOS!$C$27))","v":"-"},{"$f":"IF(B516=\"-\",\"-\",IF(B516=1,CALCULOS!$C$47,IF(MOD(B515,12)=0,E514*(1+CALCULOS!$C$28),E515))*IF(MOD(B516,12)=0,2,1))","v":"-"},{"$f":"IF(B516=\"-\",\"-\",F515*(1+CALCULOS!$C$27)+E516)","v":"-"},"-"]
[null,{"$f":"IF(OR(B516>=CALCULOS!$F$18,B516=\"-\"),\"-\",B516+1)","v":"-"},{"$f":"IF(B517=\"-\",\"-\",CALCULOS!$F$14+B517)","v":"-"},{"$f":"IF(B517=\"-\",\"-\",D516*(1+CALCULOS!$C$27))","v":"-"},{"$f":"IF(B517=\"-\",\"-\",IF(B517=1,CALCULOS!$C$47,IF(MOD(B516,12)=0,E515*(1+CALCULOS!$C$28),E516))*IF(MOD(B517,12)=0,2,1))","v":"-"},{"$f":"IF(B517=\"-\",\"-\",F516*(1+CALCULOS!$C$27)+E517)","v":"-"},"-"]
[null,{"$f":"IF(OR(B517>=CALCULOS!$F$18,B517=\"-\"),\"-\",B517+1)","v":"-"},{"$f":"IF(B518=\"-\",\"-\",CALCULOS!$F$14+B518)","v":"-"},{"$f":"IF(B518=\"-\",\"-\",D517*(1+CALCULOS!$C$27))","v":"-"},{"$f":"IF(B518=\"-\",\"-\",IF(B518=1,CALCULOS!$C$47,IF(MOD(B517,12)=0,E516*(1+CALCULOS!$C$28),E517))*IF(MOD(B518,12)=0,2,1))","v":"-"},{"$f":"IF(B518=\"-\",\"-\",F517*(1+CALCULOS!$C$27)+E518)","v":"-"},"-"]
[null,{"$f":"IF(OR(B518>=CALCULOS!$F$18,B518=\"-\"),\"-\",B518+1)","v":"-"},{"$f":"IF(B519=\"-\",\"-\",CALCULOS!$F$14+B519)","v":"-"},{"$f":"IF(B519=\"-\",\"-\",D518*(1+CALCULOS!$C$27))","v":"-"},{"$f":"IF(B519=\"-\",\"-\",IF(B519=1,CALCULOS!$C$47,IF(MOD(B518,12)=0,E517*(1+CALCULOS!$C$28),E518))*IF(MOD(B519,12)=0,2,1))","v":"-"},{"$f":"IF(B519=\"-\",\"-\",F518*(1+CALCULOS!$C$27)+E519)","v":"-"},"-"]
[null,{"$f":"IF(OR(B519>=CALCULOS!$F$18,B519=\"-\"),\"-\",B519+1)","v":"-"},{"$f":"IF(B520=\"-\",\"-\",CALCULOS!$F$14+B520)","v":"-"},{"$f":"IF(B520=\"-\",\"-\",D519*(1+CALCULOS!$C$27))","v":"-"},{"$f":"IF(B520=\"-\",\"-\",IF(B520=1,CALCULOS!$C$47,IF(MOD(B519,12)=0,E518*(1+CALCULOS!$C$28),E519))*IF(MOD(B520,12)=0,2,1))","v":"-"},{"$f":"IF(B520=\"-\",\"-\",F519*(1+CALCULOS!$C$27)+E520)","v":"-"},"-"]
[null,{"$f":"IF(OR(B520>=CALCULOS!$F$18,B520=\"-\"),\"-\",B520+1)","v":"-"},{"$f":"IF(B521=\"-\",\"-\",CALCULOS!$F$14+B521)","v":"-"},{"$f":"IF(B521=\"-\",\"-\",D520*(1+CALCULOS!$C$27))","v":"-"},{"$f":"IF(B521=\"-\",\"-\",IF(B521=1,CALCULOS!$C$47,IF(MOD(B520,12)=0,E519*(1+CALCULOS!$C$28),E520))*IF(MOD(B521,12)=0,2,1))","v":"-"},{"$f":"IF(B521=\"-\",\"-\",F520*(1+CALCULOS!$C$27)+E521)","v":"-"},"-"]
[null,{"$f":"IF(OR(B521>=CALCULOS!$F$18,B521=\"-\"),\"-\",B521+1)","v":"-"},{"$f":"IF(B522=\"-\",\"-\",CALCULOS!$F$14+B522)","v":"-"},{"$f":"IF(B522=\"-\",\"-\",D521*(1+CALCULOS!$C$27))","v":"-"},{"$f":"IF(B522=\"-\",\"-\",IF(B522=1,CALCULOS!$C$47,IF(MOD(B521,12)=0,E520*(1+CALCULOS!$C$28),E521))*IF(MOD(B522,12)=0,2,1))","v":"-"},{"$f":"IF(B522=\"-\",\"-\",F521*(1+CALCULOS!$C$27)+E522)","v":"-"},"-"]
[null,{"$f":"IF(OR(B522>=CALCULOS!$F$18,B522=\"-\"),\"-\",B522+1)","v":"-"},{"$f":"IF(B523=\"-\",\"-\",CALCULOS!$F$14+B523)","v":"-"},{"$f":"IF(B523=\"-\",\"-\",D522*(1+CALCULOS!$C$27))","v":"-"},{"$f":"IF(B523=\"-\",\"-\",IF(B523=1,CALCULOS!$C$47,IF(MOD(B522,12)=0,E521*(1+CALCULOS!$C$28),E522))*IF(MOD(B523,12)=0,2,1))","v":"-"},{"$f":"IF(B523=\"-\",\"-\",F522*(1+CALCULOS!$C$27)+E523)","v":"-"},"-"]
[null,{"$f":"IF(OR(B523>=CALCULOS!$F$18,B523=\"-\"),\"-\",B523+1)","v":"-"},{"$f":"IF(B524=\"-\",\"-\",CALCULOS!$F$14+B524)","v":"-"},{"$f":"IF(B524=\"-\",\"-\",D523*(1+CALCULOS!$C$27))","v":"-"},{"$f":"IF(B524=\"-\",\"-\",IF(B524=1,CALCULOS!$C$47,IF(MOD(B523,12)=0,E522*(1+CALCULOS!$C$28),E523))*IF(MOD(B524,12)=0,2,1))","v":"-"},{"$f":"IF(B524=\"-\",\"-\",F523*(1+CALCULOS!$C$27)+E524)","v":"-"},"-"]
[null,{"$f":"IF(OR(B524>=CALCULOS!$F$18,B524=\"-\"),\"-\",B524+1)","v":"-"},{"$f":"IF(B525=\"-\",\"-\",CALCULOS!$F$14+B525)","v":"-"},{"$f":"IF(B525=\"-\",\"-\",D524*(1+CALCULOS!$C$27))","v":"-"},{"$f":"IF(B525=\"-\",\"-\",IF(B525=1,CALCULOS!$C$47,IF(MOD(B524,12)=0,E523*(1+CALCULOS!$C$28),E524))*IF(MOD(B525,12)=0,2,1))","v":"-"},{"$f":"IF(B525=\"-\",\"-\",F524*(1+CALCULOS!$C$27)+E525)","v":"-"},"-"]
[null,{"$f":"IF(OR(B525>=CALCULOS!$F$18,B525=\"-\"),\"-\",B525+1)","v":"-"},{"$f":"IF(B526=\"-\",\"-\",CALCULOS!$F$14+B526)","v":"-"},{"$f":"IF(B526=\"-\",\"-\",D525*(1+CALCULOS!$C$27))","v":"-"},{"$f":"IF(B526=\"-\",\"-\",IF(B526=1,CALCULOS!$C$47,IF(MOD(B525,12)=0,E524*(1+CALCULOS!$C$28),E525))*IF(MOD(B526,12)=0,2,1))","v":"-"},{"$f":"IF(B526=\"-\",\"-\",F525*(1+CALCULOS!$C$27)+E526)","v":"-"},"-"]
[null,{"$f":"IF(OR(B526>=CALCULOS!$F$18,B526=\"-\"),\"-\",B526+1)","v":"-"},{"$f":"IF(B527=\"-\",\"-\",CALCULOS!$F$14+B527)","v":"-"},{"$f":"IF(B527=\"-\",\"-\",D526*(1+CALCULOS!$C$27))","v":"-"},{"$f":"IF(B527=\"-\",\"-\",IF(B527=1,CALCULOS!$C$47,IF(MOD(B526,12)=0,E525*(1+CALCULOS!$C$28),E526))*IF(MOD(B527,12)=0,2,1))","v":"-"},{"$f":"IF(B527=\"-\",\"-\",F526*(1+CALCULOS!$C$27)+E527)","v":"-"},"-"]
[null,{"$f":"IF(OR(B527>=CALCULOS!$F$18,B527=\"-\"),\"-\",B527+1)","v":"-"},{"$f":"IF(B528=\"-\",\"-\",CALCULOS!$F$14+B528)","v":"-"},{"$f":"IF(B528=\"-\",\"-\",D527*(1+CALCULOS!$C$27))","v":"-"},{"$f":"IF(B528=\"-\",\"-\",IF(B528=1,CALCULOS!$C$47,IF(MOD(B527,12)=0,E526*(1+CALCULOS!$C$28),E527))*IF(MOD(B528,12)=0,2,1))","v":"-"},{"$f":"IF(B528=\"-\",\"-\",F527*(1+CALCULOS!$C$27)+E528)","v":"-"},"-"]
[null,{"$f":"IF(OR(B528>=CALCULOS!$F$18,B528=\"-\"),\"-\",B528+1)","v":"-"},{"$f":"IF(B529=\"-\",\"-\",CALCULOS!$F$14+B529)","v":"-"},{"$f":"IF(B529=\"-\",\"-\",D528*(1+CALCULOS!$C$27))","v":"-"},{"$f":"IF(B529=\"-\",\"-\",IF(B529=1,CALCULOS!$C$47,IF(MOD(B528,12)=0,E527*(1+CALCULOS!$C$28),E528))*IF(MOD(B529,12)=0,2,1))","v":"-"},{"$f":"IF(B529=\"-\",\"-\",F528*(1+CALCULOS!$C$27)+E529)","v":"-"},"-"]
[null,{"$f":"IF(OR(B529>=CALCULOS!$F$18,B529=\"-\"),\"-\",B529+1)","v":"-"},{"$f":"IF(B530=\"-\",\"-\",CALCULOS!$F$14+B530)","v":"-"},{"$f":"IF(B530=\"-\",\"-\",D529*(1+CALCULOS!$C$27))","v":"-"},{"$f":"IF(B530=\"-\",\"-\",IF(B530=1,CALCULOS!$C$47,IF(MOD(B529,12)=0,E528*(1+CALCULOS!$C$28),E529))*IF(MOD(B530,12)=0,2,1))","v":"-"},{"$f":"IF(B530=\"-\",\"-\",F529*(1+CALCULOS!$C$27)+E530)","v":"-"},"-"]
[null,{"$f":"IF(OR(B530>=CALCULOS!$F$18,B530=\"-\"),\"-\",B530+1)","v":"-"},{"$f":"IF(B531=\"-\",\"-\",CALCULOS!$F$14+B531)","v":"-"},{"$f":"IF(B531=\"-\",\"-\",D530*(1+CALCULOS!$C$27))","v":"-"},{"$f":"IF(B531=\"-\",\"-\",IF(B531=1,CALCULOS!$C$47,IF(MOD(B530,12)=0,E529*(1+CALCULOS!$C$28),E530))*IF(MOD(B531,12)=0,2,1))","v":"-"},{"$f":"IF(B531=\"-\",\"-\",F530*(1+CALCULOS!$C$27)+E531)","v":"-"},"-"]
[null,{"$f":"IF(OR(B531>=CALCULOS!$F$18,B531=\"-\"),\"-\",B531+1)","v":"-"},{"$f":"IF(B532=\"-\",\"-\",CALCULOS!$F$14+B532)","v":"-"},{"$f":"IF(B532=\"-\",\"-\",D531*(1+CALCULOS!$C$27))","v":"-"},{"$f":"IF(B532=\"-\",\"-\",IF(B532=1,CALCULOS!$C$47,IF(MOD(B531,12)=0,E530*(1+CALCULOS!$C$28),E531))*IF(MOD(B532,12)=0,2,1))","v":"-"},{"$f":"IF(B532=\"-\",\"-\",F531*(1+CALCULOS!$C$27)+E532)","v":"-"},"-"]
[null,{"$f":"IF(OR(B532>=CALCULOS!$F$18,B532=\"-\"),\"-\",B532+1)","v":"-"},{"$f":"IF(B533=\"-\",\"-\",CALCULOS!$F$14+B533)","v":"-"},{"$f":"IF(B533=\"-\",\"-\",D532*(1+CALCULOS!$C$27))","v":"-"},{"$f":"IF(B533=\"-\",\"-\",IF(B533=1,CALCULOS!$C$47,IF(MOD(B532,12)=0,E531*(1+CALCULOS!$C$28),E532))*IF(MOD(B533,12)=0,2,1))","v":"-"},{"$f":"IF(B533=\"-\",\"-\",F532*(1+CALCULOS!$C$27)+E533)","v":"-"},"-"]
[null,{"$f":"IF(OR(B533>=CALCULOS!$F$18,B533=\"-\"),\"-\",B533+1)","v":"-"},{"$f":"IF(B534=\"-\",\"-\",CALCULOS!$F$14+B534)","v":"-"},{"$f":"IF(B534=\"-\",\"-\",D533*(1+CALCULOS!$C$27))","v":"-"},{"$f":"IF(B534=\"-\",\"-\",IF(B534=1,CALCULOS!$C$47,IF(MOD(B533,12)=0,E532*(1+CALCULOS!$C$28),E533))*IF(MOD(B534,12)=0,2,1))","v":"-"},{"$f":"IF(B534=\"-\",\"-\",F533*(1+CALCULOS!$C$27)+E534)","v":"-"},"-"]
[null,{"$f":"IF(OR(B534>=CALCULOS!$F$18,B534=\"-\"),\"-\",B534+1)","v":"-"},{"$f":"IF(B535=\"-\",\"-\",CALCULOS!$F$14+B535)","v":"-"},{"$f":"IF(B535=\"-\",\"-\",D534*(1+CALCULOS!$C$27))","v":"-"},{"$f":"IF(B535=\"-\",\"-\",IF(B535=1,CALCULOS!$C$47,IF(MOD(B534,12)=0,E533*(1+CALCULOS!$C$28),E534))*IF(MOD(B535,12)=0,2,1))","v":"-"},{"$f":"IF(B535=\"-\",\"-\",F534*(1+CALCULOS!$C$27)+E535)","v":"-"},"-"]
[null,{"$f":"IF(OR(B535>=CALCULOS!$F$18,B535=\"-\"),\"-\",B535+1)","v":"-"},{"$f":"IF(B536=\"-\",\"-\",CALCULOS!$F$14+B536)","v":"-"},{"$f":"IF(B536=\"-\",\"-\",D535*(1+CALCULOS!$C$27))","v":"-"},{"$f":"IF(B536=\"-\",\"-\",IF(B536=1,CALCULOS!$C$47,IF(MOD(B535,12)=0,E534*(1+CALCULOS!$C$28),E535))*IF(MOD(B536,12)=0,2,1))","v":"-"},{"$f":"IF(B536=\"-\",\"-\",F535*(1+CALCULOS!$C$27)+E536)","v":"-"},"-"]
[null,{"$f":"IF(OR(B536>=CALCULOS!$F$18,B536=\"-\"),\"-\",B536+1)","v":"-"},{"$f":"IF(B537=\"-\",\"-\",CALCULOS!$F$14+B537)","v":"-"},{"$f":"IF(B537=\"-\",\"-\",D536*(1+CALCULOS!$C$27))","v":"-"},{"$f":"IF(B537=\"-\",\"-\",IF(B537=1,CALCULOS!$C$47,IF(MOD(B536,12)=0,E535*(1+CALCULOS!$C$28),E536))*IF(MOD(B537,12)=0,2,1))","v":"-"},{"$f":"IF(B537=\"-\",\"-\",F536*(1+CALCULOS!$C$27)+E537)","v":"-"},{"$f":"IF(B537=\"-\",\"-\",SUM(D537,F537))","v":"-"}]
[null,{"$f":"IF(OR(B537>=CALCULOS!$F$18,B537=\"-\"),\"-\",B537+1)","v":"-"},{"$f":"IF(B538=\"-\",\"-\",CALCULOS!$F$14+B538)","v":"-"},{"$f":"IF(B538=\"-\",\"-\",D537*(1+CALCULOS!$C$27))","v":"-"},{"$f":"IF(B538=\"-\",\"-\",IF(B538=1,CALCULOS!$C$47,IF(MOD(B537,12)=0,E536*(1+CALCULOS!$C$28),E537))*IF(MOD(B538,12)=0,2,1))","v":"-"},{"$f":"IF(B538=\"-\",\"-\",F537*(1+CALCULOS!$C$27)+E538)","v":"-"},"-"]
[null,{"$f":"IF(OR(B538>=CALCULOS!$F$18,B538=\"-\"),\"-\",B538+1)","v":"-"},{"$f":"IF(B539=\"-\",\"-\",CALCULOS!$F$14+B539)","v":"-"},{"$f":"IF(B539=\"-\",\"-\",D538*(1+CALCULOS!$C$27))","v":"-"},{"$f":"IF(B539=\"-\",\"-\",IF(B539=1,CALCULOS!$C$47,IF(MOD(B538,12)=0,E537*(1+CALCULOS!$C$28),E538))*IF(MOD(B539,12)=0,2,1))","v":"-"},{"$f":"IF(B539=\"-\",\"-\",F538*(1+CALCULOS!$C$27)+E539)","v":"-"},"-"]
[null,{"$f":"IF(OR(B539>=CALCULOS!$F$18,B539=\"-\"),\"-\",B539+1)","v":"-"},{"$f":"IF(B540=\"-\",\"-\",CALCULOS!$F$14+B540)","v":"-"},{"$f":"IF(B540=\"-\",\"-\",D539*(1+CALCULOS!$C$27))","v":"-"},{"$f":"IF(B540=\"-\",\"-\",IF(B540=1,CALCULOS!$C$47,IF(MOD(B539,12)=0,E538*(1+CALCULOS!$C$28),E539))*IF(MOD(B540,12)=0,2,1))","v":"-"},{"$f":"IF(B540=\"-\",\"-\",F539*(1+CALCULOS!$C$27)+E540)","v":"-"},"-"]
[null,{"$f":"IF(OR(B540>=CALCULOS!$F$18,B540=\"-\"),\"-\",B540+1)","v":"-"},{"$f":"IF(B541=\"-\",\"-\",CALCULOS!$F$14+B541)","v":"-"},{"$f":"IF(B541=\"-\",\"-\",D540*(1+CALCULOS!$C$27))","v":"-"},{"$f":"IF(B541=\"-\",\"-\",IF(B541=1,CALCULOS!$C$47,IF(MOD(B540,12)=0,E539*(1+CALCULOS!$C$28),E540))*IF(MOD(B541,12)=0,2,1))","v":"-"},{"$f":"IF(B541=\"-\",\"-\",F540*(1+CALCULOS!$C$27)+E541)","v":"-"},"-"]
[null,{"$f":"IF(OR(B541>=CALCULOS!$F$18,B541=\"-\"),\"-\",B541+1)","v":"-"},{"$f":"IF(B542=\"-\",\"-\",CALCULOS!$F$14+B542)","v":"-"},{"$f":"IF(B542=\"-\",\"-\",D541*(1+CALCULOS!$C$27))","v":"-"},{"$f":"IF(B542=\"-\",\"-\",IF(B542=1,CALCULOS!$C$47,IF(MOD(B541,12)=0,E540*(1+CALCULOS!$C$28),E541))*IF(MOD(B542,12)=0,2,1))","v":"-"},{"$f":"IF(B542=\"-\",\"-\",F541*(1+CALCULOS!$C$27)+E542)","v":"-"},"-"]
[null,{"$f":"IF(OR(B542>=CALCULOS!$F$18,B542=\"-\"),\"-\",B542+1)","v":"-"},{"$f":"IF(B543=\"-\",\"-\",CALCULOS!$F$14+B543)","v":"-"},{"$f":"IF(B543=\"-\",\"-\",D542*(1+CALCULOS!$C$27))","v":"-"},{"$f":"IF(B543=\"-\",\"-\",IF(B543=1,CALCULOS!$C$47,IF(MOD(B542,12)=0,E541*(1+CALCULOS!$C$28),E542))*IF(MOD(B543,12)=0,2,1))","v":"-"},{"$f":"IF(B543=\"-\",\"-\",F542*(1+CALCULOS!$C$27)+E543)","v":"-"},"-"]
[null,{"$f":"IF(OR(B543>=CALCULOS!$F$18,B543=\"-\"),\"-\",B543+1)","v":"-"},{"$f":"IF(B544=\"-\",\"-\",CALCULOS!$F$14+B544)","v":"-"},{"$f":"IF(B544=\"-\",\"-\",D543*(1+CALCULOS!$C$27))","v":"-"},{"$f":"IF(B544=\"-\",\"-\",IF(B544=1,CALCULOS!$C$47,IF(MOD(B543,12)=0,E542*(1+CALCULOS!$C$28),E543))*IF(MOD(B544,12)=0,2,1))","v":"-"},{"$f":"IF(B544=\"-\",\"-\",F543*(1+CALCULOS!$C$27)+E544)","v":"-"},"-"]
[null,{"$f":"IF(OR(B544>=CALCULOS!$F$18,B544=\"-\"),\"-\",B544+1)","v":"-"},{"$f":"IF(B545=\"-\",\"-\",CALCULOS!$F$14+B545)","v":"-"},{"$f":"IF(B545=\"-\",\"-\",D544*(1+CALCULOS!$C$27))","v":"-"},{"$f":"IF(B545=\"-\",\"-\",IF(B545=1,CALCULOS!$C$47,IF(MOD(B544,12)=0,E543*(1+CALCULOS!$C$28),E544))*IF(MOD(B545,12)=0,2,1))","v":"-"},{"$f":"IF(B545=\"-\",\"-\",F544*(1+CALCULOS!$C$27)+E545)","v":"-"},"-"]
[null,{"$f":"IF(OR(B545>=CALCULOS!$F$18,B545=\"-\"),\"-\",B545+1)","v":"-"},{"$f":"IF(B546=\"-\",\"-\",CALCULOS!$F$14+B546)","v":"-"},{"$f":"IF(B546=\"-\",\"-\",D545*(1+CALCULOS!$C$27))","v":"-"},{"$f":"IF(B546=\"-\",\"-\",IF(B546=1,CALCULOS!$C$47,IF(MOD(B545,12)=0,E544*(1+CALCULOS!$C$28),E545))*IF(MOD(B546,12)=0,2,1))","v":"-"},{"$f":"IF(B546=\"-\",\"-\",F545*(1+CALCULOS!$C$27)+E546)","v":"-"},"-"]
[null,{"$f":"IF(OR(B546>=CALCULOS!$F$18,B546=\"-\"),\"-\",B546+1)","v":"-"},{"$f":"IF(B547=\"-\",\"-\",CALCULOS!$F$14+B547)","v":"-"},{"$f":"IF(B547=\"-\",\"-\",D546*(1+CALCULOS!$C$27))","v":"-"},{"$f":"IF(B547=\"-\",\"-\",IF(B547=1,CALCULOS!$C$47,IF(MOD(B546,12)=0,E545*(1+CALCULOS!$C$28),E546))*IF(MOD(B547,12)=0,2,1))","v":"-"},{"$f":"IF(B547=\"-\",\"-\",F546*(1+CALCULOS!$C$27)+E547)","v":"-"},"-"]
[null,{"$f":"IF(OR(B547>=CALCULOS!$F$18,B547=\"-\"),\"-\",B547+1)","v":"-"},{"$f":"IF(B548=\"-\",\"-\",CALCULOS!$F$14+B548)","v":"-"},{"$f":"IF(B548=\"-\",\"-\",D547*(1+CALCULOS!$C$27))","v":"-"},{"$f":"IF(B548=\"-\",\"-\",IF(B548=1,CALCULOS!$C$47,IF(MOD(B547,12)=0,E546*(1+CALCULOS!$C$28),E547))*IF(MOD(B548,12)=0,2,1))","v":"-"},{"$f":"IF(B548=\"-\",\"-\",F547*(1+CALCULOS!$C$27)+E548)","v":"-"},"-"]
[null,{"$f":"IF(OR(B548>=CALCULOS!$F$18,B548=\"-\"),\"-\",B548+1)","v":"-"},{"$f":"IF(B549=\"-\",\"-\",CALCULOS!$F$14+B549)","v":"-"},{"$f":"IF(B549=\"-\",\"-\",D548*(1+CALCULOS!$C$27))","v":"-"},{"$f":"IF(B549=\"-\",\"-\",IF(B549=1,CALCULOS!$C$47,IF(MOD(B548,12)=0,E547*(1+CALCULOS!$C$28),E548))*IF(MOD(B549,12)=0,2,1))","v":"-"},{"$f":"IF(B549=\"-\",\"-\",F548*(1+CALCULOS!$C$27)+E549)","v":"-"},"-"]
[null,{"$f":"IF(OR(B549>=CALCULOS!$F$18,B549=\"-\"),\"-\",B549+1)","v":"-"},{"$f":"IF(B550=\"-\",\"-\",CALCULOS!$F$14+B550)","v":"-"},{"$f":"IF(B550=\"-\",\"-\",D549*(1+CALCULOS!$C$27))","v":"-"},{"$f":"IF(B550=\"-\",\"-\",IF(B550=1,CALCULOS!$C$47,IF(MOD(B549,12)=0,E548*(1+CALCULOS!$C$28),E549))*IF(MOD(B550,12)=0,2,1))","v":"-"},{"$f":"IF(B550=\"-\",\"-\",F549*(1+CALCULOS!$C$27)+E550)","v":"-"},"-"]
[null,{"$f":"IF(OR(B550>=CALCULOS!$F$18,B550=\"-\"),\"-\",B550+1)","v":"-"},{"$f":"IF(B551=\"-\",\"-\",CALCULOS!$F$14+B551)","v":"-"},{"$f":"IF(B551=\"-\",\"-\",D550*(1+CALCULOS!$C$27))","v":"-"},{"$f":"IF(B551=\"-\",\"-\",IF(B551=1,CALCULOS!$C$47,IF(MOD(B550,12)=0,E549*(1+CALCULOS!$C$28),E550))*IF(MOD(B551,12)=0,2,1))","v":"-"},{"$f":"IF(B551=\"-\",\"-\",F550*(1+CALCULOS!$C$27)+E551)","v":"-"},"-"]
[null,{"$f":"IF(OR(B551>=CALCULOS!$F$18,B551=\"-\"),\"-\",B551+1)","v":"-"},{"$f":"IF(B552=\"-\",\"-\",CALCULOS!$F$14+B552)","v":"-"},{"$f":"IF(B552=\"-\",\"-\",D551*(1+CALCULOS!$C$27))","v":"-"},{"$f":"IF(B552=\"-\",\"-\",IF(B552=1,CALCULOS!$C$47,IF(MOD(B551,12)=0,E550*(1+CALCULOS!$C$28),E551))*IF(MOD(B552,12)=0,2,1))","v":"-"},{"$f":"IF(B552=\"-\",\"-\",F551*(1+CALCULOS!$C$27)+E552)","v":"-"},"-"]
[null,{"$f":"IF(OR(B552>=CALCULOS!$F$18,B552=\"-\"),\"-\",B552+1)","v":"-"},{"$f":"IF(B553=\"-\",\"-\",CALCULOS!$F$14+B553)","v":"-"},{"$f":"IF(B553=\"-\",\"-\",D552*(1+CALCULOS!$C$27))","v":"-"},{"$f":"IF(B553=\"-\",\"-\",IF(B553=1,CALCULOS!$C$47,IF(MOD(B552,12)=0,E551*(1+CALCULOS!$C$28),E552))*IF(MOD(B553,12)=0,2,1))","v":"-"},{"$f":"IF(B553=\"-\",\"-\",F552*(1+CALCULOS!$C$27)+E553)","v":"-"},"-"]
[null,{"$f":"IF(OR(B553>=CALCULOS!$F$18,B553=\"-\"),\"-\",B553+1)","v":"-"},{"$f":"IF(B554=\"-\",\"-\",CALCULOS!$F$14+B554)","v":"-"},{"$f":"IF(B554=\"-\",\"-\",D553*(1+CALCULOS!$C$27))","v":"-"},{"$f":"IF(B554=\"-\",\"-\",IF(B554=1,CALCULOS!$C$47,IF(MOD(B553,12)=0,E552*(1+CALCULOS!$C$28),E553))*IF(MOD(B554,12)=0,2,1))","v":"-"},{"$f":"IF(B554=\"-\",\"-\",F553*(1+CALCULOS!$C$27)+E554)","v":"-"},"-"]
[null,{"$f":"IF(OR(B554>=CALCULOS!$F$18,B554=\"-\"),\"-\",B554+1)","v":"-"},{"$f":"IF(B555=\"-\",\"-\",CALCULOS!$F$14+B555)","v":"-"},{"$f":"IF(B555=\"-\",\"-\",D554*(1+CALCULOS!$C$27))","v":"-"},{"$f":"IF(B555=\"-\",\"-\",IF(B555=1,CALCULOS!$C$47,IF(MOD(B554,12)=0,E553*(1+CALCULOS!$C$28),E554))*IF(MOD(B555,12)=0,2,1))","v":"-"},{"$f":"IF(B555=\"-\",\"-\",F554*(1+CALCULOS!$C$27)+E555)","v":"-"},"-"]
[null,{"$f":"IF(OR(B555>=CALCULOS!$F$18,B555=\"-\"),\"-\",B555+1)","v":"-"},{"$f":"IF(B556=\"-\",\"-\",CALCULOS!$F$14+B556)","v":"-"},{"$f":"IF(B556=\"-\",\"-\",D555*(1+CALCULOS!$C$27))","v":"-"},{"$f":"IF(B556=\"-\",\"-\",IF(B556=1,CALCULOS!$C$47,IF(MOD(B555,12)=0,E554*(1+CALCULOS!$C$28),E555))*IF(MOD(B556,12)=0,2,1))","v":"-"},{"$f":"IF(B556=\"-\",\"-\",F555*(1+CALCULOS!$C$27)+E556)","v":"-"},"-"]
[null,{"$f":"IF(OR(B556>=CALCULOS!$F$18,B556=\"-\"),\"-\",B556+1)","v":"-"},{"$f":"IF(B557=\"-\",\"-\",CALCULOS!$F$14+B557)","v":"-"},{"$f":"IF(B557=\"-\",\"-\",D556*(1+CALCULOS!$C$27))","v":"-"},{"$f":"IF(B557=\"-\",\"-\",IF(B557=1,CALCULOS!$C$47,IF(MOD(B556,12)=0,E555*(1+CALCULOS!$C$28),E556))*IF(MOD(B557,12)=0,2,1))","v":"-"},{"$f":"IF(B557=\"-\",\"-\",F556*(1+CALCULOS!$C$27)+E557)","v":"-"},"-"]
[null,{"$f":"IF(OR(B557>=CALCULOS!$F$18,B557=\"-\"),\"-\",B557+1)","v":"-"},{"$f":"IF(B558=\"-\",\"-\",CALCULOS!$F$14+B558)","v":"-"},{"$f":"IF(B558=\"-\",\"-\",D557*(1+CALCULOS!$C$27))","v":"-"},{"$f":"IF(B558=\"-\",\"-\",IF(B558=1,CALCULOS!$C$47,IF(MOD(B557,12)=0,E556*(1+CALCULOS!$C$28),E557))*IF(MOD(B558,12)=0,2,1))","v":"-"},{"$f":"IF(B558=\"-\",\"-\",F557*(1+CALCULOS!$C$27)+E558)","v":"-"},"-"]
[null,{"$f":"IF(OR(B558>=CALCULOS!$F$18,B558=\"-\"),\"-\",B558+1)","v":"-"},{"$f":"IF(B559=\"-\",\"-\",CALCULOS!$F$14+B559)","v":"-"},{"$f":"IF(B559=\"-\",\"-\",D558*(1+CALCULOS!$C$27))","v":"-"},{"$f":"IF(B559=\"-\",\"-\",IF(B559=1,CALCULOS!$C$47,IF(MOD(B558,12)=0,E557*(1+CALCULOS!$C$28),E558))*IF(MOD(B559,12)=0,2,1))","v":"-"},{"$f":"IF(B559=\"-\",\"-\",F558*(1+CALCULOS!$C$27)+E559)","v":"-"},"-"]
[null,{"$f":"IF(OR(B559>=CALCULOS!$F$18,B559=\"-\"),\"-\",B559+1)","v":"-"},{"$f":"IF(B560=\"-\",\"-\",CALCULOS!$F$14+B560)","v":"-"},{"$f":"IF(B560=\"-\",\"-\",D559*(1+CALCULOS!$C$27))","v":"-"},{"$f":"IF(B560=\"-\",\"-\",IF(B560=1,CALCULOS!$C$47,IF(MOD(B559,12)=0,E558*(1+CALCULOS!$C$28),E559))*IF(MOD(B560,12)=0,2,1))","v":"-"},{"$f":"IF(B560=\"-\",\"-\",F559*(1+CALCULOS!$C$27)+E560)","v":"-"},"-"]
[null,{"$f":"IF(OR(B560>=CALCULOS!$F$18,B560=\"-\"),\"-\",B560+1)","v":"-"},{"$f":"IF(B561=\"-\",\"-\",CALCULOS!$F$14+B561)","v":"-"},{"$f":"IF(B561=\"-\",\"-\",D560*(1+CALCULOS!$C$27))","v":"-"},{"$f":"IF(B561=\"-\",\"-\",IF(B561=1,CALCULOS!$C$47,IF(MOD(B560,12)=0,E559*(1+CALCULOS!$C$28),E560))*IF(MOD(B561,12)=0,2,1))","v":"-"},{"$f":"IF(B561=\"-\",\"-\",F560*(1+CALCULOS!$C$27)+E561)","v":"-"},"-"]
[null,{"$f":"IF(OR(B561>=CALCULOS!$F$18,B561=\"-\"),\"-\",B561+1)","v":"-"},{"$f":"IF(B562=\"-\",\"-\",CALCULOS!$F$14+B562)","v":"-"},{"$f":"IF(B562=\"-\",\"-\",D561*(1+CALCULOS!$C$27))","v":"-"},{"$f":"IF(B562=\"-\",\"-\",IF(B562=1,CALCULOS!$C$47,IF(MOD(B561,12)=0,E560*(1+CALCULOS!$C$28),E561))*IF(MOD(B562,12)=0,2,1))","v":"-"},{"$f":"IF(B562=\"-\",\"-\",F561*(1+CALCULOS!$C$27)+E562)","v":"-"},"-"]
[null,{"$f":"IF(OR(B562>=CALCULOS!$F$18,B562=\"-\"),\"-\",B562+1)","v":"-"},{"$f":"IF(B563=\"-\",\"-\",CALCULOS!$F$14+B563)","v":"-"},{"$f":"IF(B563=\"-\",\"-\",D562*(1+CALCULOS!$C$27))","v":"-"},{"$f":"IF(B563=\"-\",\"-\",IF(B563=1,CALCULOS!$C$47,IF(MOD(B562,12)=0,E561*(1+CALCULOS!$C$28),E562))*IF(MOD(B563,12)=0,2,1))","v":"-"},{"$f":"IF(B563=\"-\",\"-\",F562*(1+CALCULOS!$C$27)+E563)","v":"-"},"-"]
[null,{"$f":"IF(OR(B563>=CALCULOS!$F$18,B563=\"-\"),\"-\",B563+1)","v":"-"},{"$f":"IF(B564=\"-\",\"-\",CALCULOS!$F$14+B564)","v":"-"},{"$f":"IF(B564=\"-\",\"-\",D563*(1+CALCULOS!$C$27))","v":"-"},{"$f":"IF(B564=\"-\",\"-\",IF(B564=1,CALCULOS!$C$47,IF(MOD(B563,12)=0,E562*(1+CALCULOS!$C$28),E563))*IF(MOD(B564,12)=0,2,1))","v":"-"},{"$f":"IF(B564=\"-\",\"-\",F563*(1+CALCULOS!$C$27)+E564)","v":"-"},"-"]
[null,{"$f":"IF(OR(B564>=CALCULOS!$F$18,B564=\"-\"),\"-\",B564+1)","v":"-"},{"$f":"IF(B565=\"-\",\"-\",CALCULOS!$F$14+B565)","v":"-"},{"$f":"IF(B565=\"-\",\"-\",D564*(1+CALCULOS!$C$27))","v":"-"},{"$f":"IF(B565=\"-\",\"-\",IF(B565=1,CALCULOS!$C$47,IF(MOD(B564,12)=0,E563*(1+CALCULOS!$C$28),E564))*IF(MOD(B565,12)=0,2,1))","v":"-"},{"$f":"IF(B565=\"-\",\"-\",F564*(1+CALCULOS!$C$27)+E565)","v":"-"},"-"]
[null,{"$f":"IF(OR(B565>=CALCULOS!$F$18,B565=\"-\"),\"-\",B565+1)","v":"-"},{"$f":"IF(B566=\"-\",\"-\",CALCULOS!$F$14+B566)","v":"-"},{"$f":"IF(B566=\"-\",\"-\",D565*(1+CALCULOS!$C$27))","v":"-"},{"$f":"IF(B566=\"-\",\"-\",IF(B566=1,CALCULOS!$C$47,IF(MOD(B565,12)=0,E564*(1+CALCULOS!$C$28),E565))*IF(MOD(B566,12)=0,2,1))","v":"-"},{"$f":"IF(B566=\"-\",\"-\",F565*(1+CALCULOS!$C$27)+E566)","v":"-"},"-"]
[null,{"$f":"IF(OR(B566>=CALCULOS!$F$18,B566=\"-\"),\"-\",B566+1)","v":"-"},{"$f":"IF(B567=\"-\",\"-\",CALCULOS!$F$14+B567)","v":"-"},{"$f":"IF(B567=\"-\",\"-\",D566*(1+CALCULOS!$C$27))","v":"-"},{"$f":"IF(B567=\"-\",\"-\",IF(B567=1,CALCULOS!$C$47,IF(MOD(B566,12)=0,E565*(1+CALCULOS!$C$28),E566))*IF(MOD(B567,12)=0,2,1))","v":"-"},{"$f":"IF(B567=\"-\",\"-\",F566*(1+CALCULOS!$C$27)+E567)","v":"-"},"-"]
[null,{"$f":"IF(OR(B567>=CALCULOS!$F$18,B567=\"-\"),\"-\",B567+1)","v":"-"},{"$f":"IF(B568=\"-\",\"-\",CALCULOS!$F$14+B568)","v":"-"},{"$f":"IF(B568=\"-\",\"-\",D567*(1+CALCULOS!$C$27))","v":"-"},{"$f":"IF(B568=\"-\",\"-\",IF(B568=1,CALCULOS!$C$47,IF(MOD(B567,12)=0,E566*(1+CALCULOS!$C$28),E567))*IF(MOD(B568,12)=0,2,1))","v":"-"},{"$f":"IF(B568=\"-\",\"-\",F567*(1+CALCULOS!$C$27)+E568)","v":"-"},"-"]
[null,{"$f":"IF(OR(B568>=CALCULOS!$F$18,B568=\"-\"),\"-\",B568+1)","v":"-"},{"$f":"IF(B569=\"-\",\"-\",CALCULOS!$F$14+B569)","v":"-"},{"$f":"IF(B569=\"-\",\"-\",D568*(1+CALCULOS!$C$27))","v":"-"},{"$f":"IF(B569=\"-\",\"-\",IF(B569=1,CALCULOS!$C$47,IF(MOD(B568,12)=0,E567*(1+CALCULOS!$C$28),E568))*IF(MOD(B569,12)=0,2,1))","v":"-"},{"$f":"IF(B569=\"-\",\"-\",F568*(1+CALCULOS!$C$27)+E569)","v":"-"},"-"]
[null,{"$f":"IF(OR(B569>=CALCULOS!$F$18,B569=\"-\"),\"-\",B569+1)","v":"-"},{"$f":"IF(B570=\"-\",\"-\",CALCULOS!$F$14+B570)","v":"-"},{"$f":"IF(B570=\"-\",\"-\",D569*(1+CALCULOS!$C$27))","v":"-"},{"$f":"IF(B570=\"-\",\"-\",IF(B570=1,CALCULOS!$C$47,IF(MOD(B569,12)=0,E568*(1+CALCULOS!$C$28),E569))*IF(MOD(B570,12)=0,2,1))","v":"-"},{"$f":"IF(B570=\"-\",\"-\",F569*(1+CALCULOS!$C$27)+E570)","v":"-"},"-"]
[null,{"$f":"IF(OR(B570>=CALCULOS!$F$18,B570=\"-\"),\"-\",B570+1)","v":"-"},{"$f":"IF(B571=\"-\",\"-\",CALCULOS!$F$14+B571)","v":"-"},{"$f":"IF(B571=\"-\",\"-\",D570*(1+CALCULOS!$C$27))","v":"-"},{"$f":"IF(B571=\"-\",\"-\",IF(B571=1,CALCULOS!$C$47,IF(MOD(B570,12)=0,E569*(1+CALCULOS!$C$28),E570))*IF(MOD(B571,12)=0,2,1))","v":"-"},{"$f":"IF(B571=\"-\",\"-\",F570*(1+CALCULOS!$C$27)+E571)","v":"-"},"-"]
[null,{"$f":"IF(OR(B571>=CALCULOS!$F$18,B571=\"-\"),\"-\",B571+1)","v":"-"},{"$f":"IF(B572=\"-\",\"-\",CALCULOS!$F$14+B572)","v":"-"},{"$f":"IF(B572=\"-\",\"-\",D571*(1+CALCULOS!$C$27))","v":"-"},{"$f":"IF(B572=\"-\",\"-\",IF(B572=1,CALCULOS!$C$47,IF(MOD(B571,12)=0,E570*(1+CALCULOS!$C$28),E571))*IF(MOD(B572,12)=0,2,1))","v":"-"},{"$f":"IF(B572=\"-\",\"-\",F571*(1+CALCULOS!$C$27)+E572)","v":"-"},"-"]
[null,{"$f":"IF(OR(B572>=CALCULOS!$F$18,B572=\"-\"),\"-\",B572+1)","v":"-"},{"$f":"IF(B573=\"-\",\"-\",CALCULOS!$F$14+B573)","v":"-"},{"$f":"IF(B573=\"-\",\"-\",D572*(1+CALCULOS!$C$27))","v":"-"},{"$f":"IF(B573=\"-\",\"-\",IF(B573=1,CALCULOS!$C$47,IF(MOD(B572,12)=0,E571*(1+CALCULOS!$C$28),E572))*IF(MOD(B573,12)=0,2,1))","v":"-"},{"$f":"IF(B573=\"-\",\"-\",F572*(1+CALCULOS!$C$27)+E573)","v":"-"},"-"]
[null,{"$f":"IF(OR(B573>=CALCULOS!$F$18,B573=\"-\"),\"-\",B573+1)","v":"-"},{"$f":"IF(B574=\"-\",\"-\",CALCULOS!$F$14+B574)","v":"-"},{"$f":"IF(B574=\"-\",\"-\",D573*(1+CALCULOS!$C$27))","v":"-"},{"$f":"IF(B574=\"-\",\"-\",IF(B574=1,CALCULOS!$C$47,IF(MOD(B573,12)=0,E572*(1+CALCULOS!$C$28),E573))*IF(MOD(B574,12)=0,2,1))","v":"-"},{"$f":"IF(B574=\"-\",\"-\",F573*(1+CALCULOS!$C$27)+E574)","v":"-"},"-"]
[null,{"$f":"IF(OR(B574>=CALCULOS!$F$18,B574=\"-\"),\"-\",B574+1)","v":"-"},{"$f":"IF(B575=\"-\",\"-\",CALCULOS!$F$14+B575)","v":"-"},{"$f":"IF(B575=\"-\",\"-\",D574*(1+CALCULOS!$C$27))","v":"-"},{"$f":"IF(B575=\"-\",\"-\",IF(B575=1,CALCULOS!$C$47,IF(MOD(B574,12)=0,E573*(1+CALCULOS!$C$28),E574))*IF(MOD(B575,12)=0,2,1))","v":"-"},{"$f":"IF(B575=\"-\",\"-\",F574*(1+CALCULOS!$C$27)+E575)","v":"-"},"-"]
[null,{"$f":"IF(OR(B575>=CALCULOS!$F$18,B575=\"-\"),\"-\",B575+1)","v":"-"},{"$f":"IF(B576=\"-\",\"-\",CALCULOS!$F$14+B576)","v":"-"},{"$f":"IF(B576=\"-\",\"-\",D575*(1+CALCULOS!$C$27))","v":"-"},{"$f":"IF(B576=\"-\",\"-\",IF(B576=1,CALCULOS!$C$47,IF(MOD(B575,12)=0,E574*(1+CALCULOS!$C$28),E575))*IF(MOD(B576,12)=0,2,1))","v":"-"},{"$f":"IF(B576=\"-\",\"-\",F575*(1+CALCULOS!$C$27)+E576)","v":"-"},"-"]
[null,{"$f":"IF(OR(B576>=CALCULOS!$F$18,B576=\"-\"),\"-\",B576+1)","v":"-"},{"$f":"IF(B577=\"-\",\"-\",CALCULOS!$F$14+B577)","v":"-"},{"$f":"IF(B577=\"-\",\"-\",D576*(1+CALCULOS!$C$27))","v":"-"},{"$f":"IF(B577=\"-\",\"-\",IF(B577=1,CALCULOS!$C$47,IF(MOD(B576,12)=0,E575*(1+CALCULOS!$C$28),E576))*IF(MOD(B577,12)=0,2,1))","v":"-"},{"$f":"IF(B577=\"-\",\"-\",F576*(1+CALCULOS!$C$27)+E577)","v":"-"},"-"]
[null,{"$f":"IF(OR(B577>=CALCULOS!$F$18,B577=\"-\"),\"-\",B577+1)","v":"-"},{"$f":"IF(B578=\"-\",\"-\",CALCULOS!$F$14+B578)","v":"-"},{"$f":"IF(B578=\"-\",\"-\",D577*(1+CALCULOS!$C$27))","v":"-"},{"$f":"IF(B578=\"-\",\"-\",IF(B578=1,CALCULOS!$C$47,IF(MOD(B577,12)=0,E576*(1+CALCULOS!$C$28),E577))*IF(MOD(B578,12)=0,2,1))","v":"-"},{"$f":"IF(B578=\"-\",\"-\",F577*(1+CALCULOS!$C$27)+E578)","v":"-"},"-"]
[null,{"$f":"IF(OR(B578>=CALCULOS!$F$18,B578=\"-\"),\"-\",B578+1)","v":"-"},{"$f":"IF(B579=\"-\",\"-\",CALCULOS!$F$14+B579)","v":"-"},{"$f":"IF(B579=\"-\",\"-\",D578*(1+CALCULOS!$C$27))","v":"-"},{"$f":"IF(B579=\"-\",\"-\",IF(B579=1,CALCULOS!$C$47,IF(MOD(B578,12)=0,E577*(1+CALCULOS!$C$28),E578))*IF(MOD(B579,12)=0,2,1))","v":"-"},{"$f":"IF(B579=\"-\",\"-\",F578*(1+CALCULOS!$C$27)+E579)","v":"-"},"-"]
[null,{"$f":"IF(OR(B579>=CALCULOS!$F$18,B579=\"-\"),\"-\",B579+1)","v":"-"},{"$f":"IF(B580=\"-\",\"-\",CALCULOS!$F$14+B580)","v":"-"},{"$f":"IF(B580=\"-\",\"-\",D579*(1+CALCULOS!$C$27))","v":"-"},{"$f":"IF(B580=\"-\",\"-\",IF(B580=1,CALCULOS!$C$47,IF(MOD(B579,12)=0,E578*(1+CALCULOS!$C$28),E579))*IF(MOD(B580,12)=0,2,1))","v":"-"},{"$f":"IF(B580=\"-\",\"-\",F579*(1+CALCULOS!$C$27)+E580)","v":"-"},"-"]
[null,{"$f":"IF(OR(B580>=CALCULOS!$F$18,B580=\"-\"),\"-\",B580+1)","v":"-"},{"$f":"IF(B581=\"-\",\"-\",CALCULOS!$F$14+B581)","v":"-"},{"$f":"IF(B581=\"-\",\"-\",D580*(1+CALCULOS!$C$27))","v":"-"},{"$f":"IF(B581=\"-\",\"-\",IF(B581=1,CALCULOS!$C$47,IF(MOD(B580,12)=0,E579*(1+CALCULOS!$C$28),E580))*IF(MOD(B581,12)=0,2,1))","v":"-"},{"$f":"IF(B581=\"-\",\"-\",F580*(1+CALCULOS!$C$27)+E581)","v":"-"},"-"]
[null,{"$f":"IF(OR(B581>=CALCULOS!$F$18,B581=\"-\"),\"-\",B581+1)","v":"-"},{"$f":"IF(B582=\"-\",\"-\",CALCULOS!$F$14+B582)","v":"-"},{"$f":"IF(B582=\"-\",\"-\",D581*(1+CALCULOS!$C$27))","v":"-"},{"$f":"IF(B582=\"-\",\"-\",IF(B582=1,CALCULOS!$C$47,IF(MOD(B581,12)=0,E580*(1+CALCULOS!$C$28),E581))*IF(MOD(B582,12)=0,2,1))","v":"-"},{"$f":"IF(B582=\"-\",\"-\",F581*(1+CALCULOS!$C$27)+E582)","v":"-"},"-"]
[null,{"$f":"IF(OR(B582>=CALCULOS!$F$18,B582=\"-\"),\"-\",B582+1)","v":"-"},{"$f":"IF(B583=\"-\",\"-\",CALCULOS!$F$14+B583)","v":"-"},{"$f":"IF(B583=\"-\",\"-\",D582*(1+CALCULOS!$C$27))","v":"-"},{"$f":"IF(B583=\"-\",\"-\",IF(B583=1,CALCULOS!$C$47,IF(MOD(B582,12)=0,E581*(1+CALCULOS!$C$28),E582))*IF(MOD(B583,12)=0,2,1))","v":"-"},{"$f":"IF(B583=\"-\",\"-\",F582*(1+CALCULOS!$C$27)+E583)","v":"-"},"-"]
[null,{"$f":"IF(OR(B583>=CALCULOS!$F$18,B583=\"-\"),\"-\",B583+1)","v":"-"},{"$f":"IF(B584=\"-\",\"-\",CALCULOS!$F$14+B584)","v":"-"},{"$f":"IF(B584=\"-\",\"-\",D583*(1+CALCULOS!$C$27))","v":"-"},{"$f":"IF(B584=\"-\",\"-\",IF(B584=1,CALCULOS!$C$47,IF(MOD(B583,12)=0,E582*(1+CALCULOS!$C$28),E583))*IF(MOD(B584,12)=0,2,1))","v":"-"},{"$f":"IF(B584=\"-\",\"-\",F583*(1+CALCULOS!$C$27)+E584)","v":"-"},"-"]
[null,{"$f":"IF(OR(B584>=CALCULOS!$F$18,B584=\"-\"),\"-\",B584+1)","v":"-"},{"$f":"IF(B585=\"-\",\"-\",CALCULOS!$F$14+B585)","v":"-"},{"$f":"IF(B585=\"-\",\"-\",D584*(1+CALCULOS!$C$27))","v":"-"},{"$f":"IF(B585=\"-\",\"-\",IF(B585=1,CALCULOS!$C$47,IF(MOD(B584,12)=0,E583*(1+CALCULOS!$C$28),E584))*IF(MOD(B585,12)=0,2,1))","v":"-"},{"$f":"IF(B585=\"-\",\"-\",F584*(1+CALCULOS!$C$27)+E585)","v":"-"},"-"]
[null,{"$f":"IF(OR(B585>=CALCULOS!$F$18,B585=\"-\"),\"-\",B585+1)","v":"-"},{"$f":"IF(B586=\"-\",\"-\",CALCULOS!$F$14+B586)","v":"-"},{"$f":"IF(B586=\"-\",\"-\",D585*(1+CALCULOS!$C$27))","v":"-"},{"$f":"IF(B586=\"-\",\"-\",IF(B586=1,CALCULOS!$C$47,IF(MOD(B585,12)=0,E584*(1+CALCULOS!$C$28),E585))*IF(MOD(B586,12)=0,2,1))","v":"-"},{"$f":"IF(B586=\"-\",\"-\",F585*(1+CALCULOS!$C$27)+E586)","v":"-"},"-"]
[null,{"$f":"IF(OR(B586>=CALCULOS!$F$18,B586=\"-\"),\"-\",B586+1)","v":"-"},{"$f":"IF(B587=\"-\",\"-\",CALCULOS!$F$14+B587)","v":"-"},{"$f":"IF(B587=\"-\",\"-\",D586*(1+CALCULOS!$C$27))","v":"-"},{"$f":"IF(B587=\"-\",\"-\",IF(B587=1,CALCULOS!$C$47,IF(MOD(B586,12)=0,E585*(1+CALCULOS!$C$28),E586))*IF(MOD(B587,12)=0,2,1))","v":"-"},{"$f":"IF(B587=\"-\",\"-\",F586*(1+CALCULOS!$C$27)+E587)","v":"-"},"-"]
[null,{"$f":"IF(OR(B587>=CALCULOS!$F$18,B587=\"-\"),\"-\",B587+1)","v":"-"},{"$f":"IF(B588=\"-\",\"-\",CALCULOS!$F$14+B588)","v":"-"},{"$f":"IF(B588=\"-\",\"-\",D587*(1+CALCULOS!$C$27))","v":"-"},{"$f":"IF(B588=\"-\",\"-\",IF(B588=1,CALCULOS!$C$47,IF(MOD(B587,12)=0,E586*(1+CALCULOS!$C$28),E587))*IF(MOD(B588,12)=0,2,1))","v":"-"},{"$f":"IF(B588=\"-\",\"-\",F587*(1+CALCULOS!$C$27)+E588)","v":"-"},"-"]
[null,{"$f":"IF(OR(B588>=CALCULOS!$F$18,B588=\"-\"),\"-\",B588+1)","v":"-"},{"$f":"IF(B589=\"-\",\"-\",CALCULOS!$F$14+B589)","v":"-"},{"$f":"IF(B589=\"-\",\"-\",D588*(1+CALCULOS!$C$27))","v":"-"},{"$f":"IF(B589=\"-\",\"-\",IF(B589=1,CALCULOS!$C$47,IF(MOD(B588,12)=0,E587*(1+CALCULOS!$C$28),E588))*IF(MOD(B589,12)=0,2,1))","v":"-"},{"$f":"IF(B589=\"-\",\"-\",F588*(1+CALCULOS!$C$27)+E589)","v":"-"},"-"]
[null,{"$f":"IF(OR(B589>=CALCULOS!$F$18,B589=\"-\"),\"-\",B589+1)","v":"-"},{"$f":"IF(B590=\"-\",\"-\",CALCULOS!$F$14+B590)","v":"-"},{"$f":"IF(B590=\"-\",\"-\",D589*(1+CALCULOS!$C$27))","v":"-"},{"$f":"IF(B590=\"-\",\"-\",IF(B590=1,CALCULOS!$C$47,IF(MOD(B589,12)=0,E588*(1+CALCULOS!$C$28),E589))*IF(MOD(B590,12)=0,2,1))","v":"-"},{"$f":"IF(B590=\"-\",\"-\",F589*(1+CALCULOS!$C$27)+E590)","v":"-"},"-"]
[null,{"$f":"IF(OR(B590>=CALCULOS!$F$18,B590=\"-\"),\"-\",B590+1)","v":"-"},{"$f":"IF(B591=\"-\",\"-\",CALCULOS!$F$14+B591)","v":"-"},{"$f":"IF(B591=\"-\",\"-\",D590*(1+CALCULOS!$C$27))","v":"-"},{"$f":"IF(B591=\"-\",\"-\",IF(B591=1,CALCULOS!$C$47,IF(MOD(B590,12)=0,E589*(1+CALCULOS!$C$28),E590))*IF(MOD(B591,12)=0,2,1))","v":"-"},{"$f":"IF(B591=\"-\",\"-\",F590*(1+CALCULOS!$C$27)+E591)","v":"-"},"-"]
[null,{"$f":"IF(OR(B591>=CALCULOS!$F$18,B591=\"-\"),\"-\",B591+1)","v":"-"},{"$f":"IF(B592=\"-\",\"-\",CALCULOS!$F$14+B592)","v":"-"},{"$f":"IF(B592=\"-\",\"-\",D591*(1+CALCULOS!$C$27))","v":"-"},{"$f":"IF(B592=\"-\",\"-\",IF(B592=1,CALCULOS!$C$47,IF(MOD(B591,12)=0,E590*(1+CALCULOS!$C$28),E591))*IF(MOD(B592,12)=0,2,1))","v":"-"},{"$f":"IF(B592=\"-\",\"-\",F591*(1+CALCULOS!$C$27)+E592)","v":"-"},"-"]
[null,{"$f":"IF(OR(B592>=CALCULOS!$F$18,B592=\"-\"),\"-\",B592+1)","v":"-"},{"$f":"IF(B593=\"-\",\"-\",CALCULOS!$F$14+B593)","v":"-"},{"$f":"IF(B593=\"-\",\"-\",D592*(1+CALCULOS!$C$27))","v":"-"},{"$f":"IF(B593=\"-\",\"-\",IF(B593=1,CALCULOS!$C$47,IF(MOD(B592,12)=0,E591*(1+CALCULOS!$C$28),E592))*IF(MOD(B593,12)=0,2,1))","v":"-"},{"$f":"IF(B593=\"-\",\"-\",F592*(1+CALCULOS!$C$27)+E593)","v":"-"},"-"]
[null,{"$f":"IF(OR(B593>=CALCULOS!$F$18,B593=\"-\"),\"-\",B593+1)","v":"-"},{"$f":"IF(B594=\"-\",\"-\",CALCULOS!$F$14+B594)","v":"-"},{"$f":"IF(B594=\"-\",\"-\",D593*(1+CALCULOS!$C$27))","v":"-"},{"$f":"IF(B594=\"-\",\"-\",IF(B594=1,CALCULOS!$C$47,IF(MOD(B593,12)=0,E592*(1+CALCULOS!$C$28),E593))*IF(MOD(B594,12)=0,2,1))","v":"-"},{"$f":"IF(B594=\"-\",\"-\",F593*(1+CALCULOS!$C$27)+E594)","v":"-"},"-"]
[null,{"$f":"IF(OR(B594>=CALCULOS!$F$18,B594=\"-\"),\"-\",B594+1)","v":"-"},{"$f":"IF(B595=\"-\",\"-\",CALCULOS!$F$14+B595)","v":"-"},{"$f":"IF(B595=\"-\",\"-\",D594*(1+CALCULOS!$C$27))","v":"-"},{"$f":"IF(B595=\"-\",\"-\",IF(B595=1,CALCULOS!$C$47,IF(MOD(B594,12)=0,E593*(1+CALCULOS!$C$28),E594))*IF(MOD(B595,12)=0,2,1))","v":"-"},{"$f":"IF(B595=\"-\",\"-\",F594*(1+CALCULOS!$C$27)+E595)","v":"-"},"-"]
[null,{"$f":"IF(OR(B595>=CALCULOS!$F$18,B595=\"-\"),\"-\",B595+1)","v":"-"},{"$f":"IF(B596=\"-\",\"-\",CALCULOS!$F$14+B596)","v":"-"},{"$f":"IF(B596=\"-\",\"-\",D595*(1+CALCULOS!$C$27))","v":"-"},{"$f":"IF(B596=\"-\",\"-\",IF(B596=1,CALCULOS!$C$47,IF(MOD(B595,12)=0,E594*(1+CALCULOS!$C$28),E595))*IF(MOD(B596,12)=0,2,1))","v":"-"},{"$f":"IF(B596=\"-\",\"-\",F595*(1+CALCULOS!$C$27)+E596)","v":"-"},"-"]
[null,{"$f":"IF(OR(B596>=CALCULOS!$F$18,B596=\"-\"),\"-\",B596+1)","v":"-"},{"$f":"IF(B597=\"-\",\"-\",CALCULOS!$F$14+B597)","v":"-"},{"$f":"IF(B597=\"-\",\"-\",D596*(1+CALCULOS!$C$27))","v":"-"},{"$f":"IF(B597=\"-\",\"-\",IF(B597=1,CALCULOS!$C$47,IF(MOD(B596,12)=0,E595*(1+CALCULOS!$C$28),E596))*IF(MOD(B597,12)=0,2,1))","v":"-"},{"$f":"IF(B597=\"-\",\"-\",F596*(1+CALCULOS!$C$27)+E597)","v":"-"},"-"]
[null,{"$f":"IF(OR(B597>=CALCULOS!$F$18,B597=\"-\"),\"-\",B597+1)","v":"-"},{"$f":"IF(B598=\"-\",\"-\",CALCULOS!$F$14+B598)","v":"-"},{"$f":"IF(B598=\"-\",\"-\",D597*(1+CALCULOS!$C$27))","v":"-"},{"$f":"IF(B598=\"-\",\"-\",IF(B598=1,CALCULOS!$C$47,IF(MOD(B597,12)=0,E596*(1+CALCULOS!$C$28),E597))*IF(MOD(B598,12)=0,2,1))","v":"-"},{"$f":"IF(B598=\"-\",\"-\",F597*(1+CALCULOS!$C$27)+E598)","v":"-"},"-"]
[null,{"$f":"IF(OR(B598>=CALCULOS!$F$18,B598=\"-\"),\"-\",B598+1)","v":"-"},{"$f":"IF(B599=\"-\",\"-\",CALCULOS!$F$14+B599)","v":"-"},{"$f":"IF(B599=\"-\",\"-\",D598*(1+CALCULOS!$C$27))","v":"-"},{"$f":"IF(B599=\"-\",\"-\",IF(B599=1,CALCULOS!$C$47,IF(MOD(B598,12)=0,E597*(1+CALCULOS!$C$28),E598))*IF(MOD(B599,12)=0,2,1))","v":"-"},{"$f":"IF(B599=\"-\",\"-\",F598*(1+CALCULOS!$C$27)+E599)","v":"-"},"-"]
[null,{"$f":"IF(OR(B599>=CALCULOS!$F$18,B599=\"-\"),\"-\",B599+1)","v":"-"},{"$f":"IF(B600=\"-\",\"-\",CALCULOS!$F$14+B600)","v":"-"},{"$f":"IF(B600=\"-\",\"-\",D599*(1+CALCULOS!$C$27))","v":"-"},{"$f":"IF(B600=\"-\",\"-\",IF(B600=1,CALCULOS!$C$47,IF(MOD(B599,12)=0,E598*(1+CALCULOS!$C$28),E599))*IF(MOD(B600,12)=0,2,1))","v":"-"},{"$f":"IF(B600=\"-\",\"-\",F599*(1+CALCULOS!$C$27)+E600)","v":"-"},"-"]

{"sheet":"SIMULAÇÃO Prazo Determinado","index":4,"n_rows":136,"n_cols":4,"rows_kept":136,"cut":false,"hidden":true,"merged":[[53,1,53,2],[27,1,27,2],[25,1,25,2],[17,3,17,4],[20,1,20,2],[21,1,21,2],[22,1,22,2],[49,1,49,2],[35,1,35,2],[47,1,47,2],[29,1,29,2],[23,1,23,2],[11,1,11,2],[17,1,17,2],[18,3,18,4],[18,1,18,2],[11,3,11,4],[15,1,15,2],[13,1,13,2],[14,1,14,2],[16,1,16,2],[13,3,13,4],[14,3,14,4],[15,3,15,4],[16,3,16,4],[122,1,131,4],[132,1,132,4],[37,1,37,4],[44,1,44,2],[23,3,23,4],[25,3,25,4],[26,3,26,4],[27,3,27,4],[28,3,28,4],[29,3,29,4],[28,1,28,2],[40,1,40,2],[26,1,26,2],[42,1,42,2],[120,1,120,2],[54,1,54,2],[57,3,59,4],[54,3,54,4],[53,3,53,4],[20,3,20,4],[21,3,21,4],[22,3,22,4]]}
[]
[]
[]
[]
[]
[]
[]
[]
[]
[]
[]
[null,"Data de Simulação",null,{"$f":"INPUT!C6","v":"2024-08-27"}]
[]
[null,"Nome do Participante / Matrícula",null,{"$f":"INPUT!C8","v":"[ inserir seu nome ]"}]
[null,"Sexo",null,{"$f":"INPUT!C9","v":0}]
[null,"Data de Nascimento",null,{"$f":"INPUT!C10","v":"00:00:00"}]
[null,"Data da Admissão na Patrocinadora",null,{"$f":"INPUT!$C$11","v":"00:00:00"}]
[null,"Data de Inscrição no Plano",null,{"$f":"INPUT!$C$12","v":"00:00:00"}]
[null,"Possuiu Dependente",null,{"$f":"INPUT!$C$13","v":"00:00:00"}]
[]
[null,"Salário de Contribuição",null,{"$f":"INPUT!C17","v":0}]
[null,"Saldo de Conta Total",null,{"$f":"INPUT!C18","v":0}]
[null,"Saldo da Conta de Recursos Portados",null,{"$f":"INPUT!C19","v":0}]
[null,"Contribuição Adicional",null,{"$f":"INPUT!C20","v":0}]
[]
[null,"Idade mínima \n(elegibilidade para Aposentadoria)",null,{"$f":"INPUT!C22","v":55}]
[null,"Idade Desejada para Aposentadoria",null,{"$f":"INPUT!C23","v":0}]
[null,"Tipo de Renda escolhida",null,{"$f":"INPUT!C24","v":"00:00:00"}]
[null,"Resgate Parcial em Parcela Única",null,{"$f":"INPUT!C25","v":0}]
[null,"Quantidade de Parcelas a Receber ao ano",null,{"$f":"INPUT!C26","v":0}]
[]
[]
[]
[null,"Resultados"]
[]
[null,"Aposentadoria e Saldo Acumulado"]
[]
[null,{"$f":"UPPER(IF(AND(CALCULOS!$C$18=0,CALCULOS!$D$18=0,CALCULOS!$E$18=0),\"Você já pode se aposentar!\",\"Você vai se aposentar em \"&IF(CALCULOS!$C$18>0,CALCULOS!$C$18&\" ano\"&IF(CALCULOS!$C$18>1,\"s\",\"\")&IF(AND(CALCULOS!$D$18>0,CALCULOS!$E$18>0),\", \",IF(OR(AND(CALCULOS!$D$18>0,CALCULOS!$E$18=0),AND(CALCULOS!$D$18=0,CALCULOS!$E$18>0)),\" e \",\"\")),\"\")&IF(CALCULOS!$D$18>0,CALCULOS!$D$18&\" mese\"&IF(CALCULOS!$D$18>1,\"s\",\"\")&IF(CALCULOS!$E$18>0,\" e \",\"\"),\"\")&IF(CALCULOS!$E$18>0,CALCULOS!$E$18&\" dia\"&IF(CALCULOS!$E$18>1,\"s\",\"\")&\"\",\"\")&\"!\"))","v":"VOCÊ JÁ PODE SE APOSENTAR!"}]
[]
[]
[null,"Data de Aposentadoria estimada",null,{"$f":"CALC_dt_apo","v":"00:00:00"}]
[]
[null,"Saldos de Conta projetados na Aposentadoria"]
[]
[null,"Conta de Benefícios (TOTAL)",null,{"$f":"CALCULOS!C53","v":0}]
[]
[]
[null,"Renda Financeira de Aposentadoria"]
[]
[null,{"$f":"\"Recebimento em Parcela Única (\"&TEXT(IN_apo_percContaBenef_parcUnica,\"0,00%\")&\")\"","v":"Recebimento em Parcela Única (0,00%)"},null,{"$f":"D45*IN_apo_percContaBenef_parcUnica","v":0}]
[]
[null,"Renda por Prazo Certo"]
[]
[null,"Opção de Prazo",null,"Renda Mensal Inicial"]
[null,{"$f":"CALCULOS!B67","v":"10 anos"},null,{"$f":"CALCULOS!C67","v":0}]
[]
[]
[null,null,null,{"$f":"\"OBS: O valor do benefício mínimo equivale a 10% da URD (R$\"&TEXT(DESBAN!$D$38,\"000,00\")&\"), caso venha a ser inferior à esse valor, o saldo remanescente será pago à vista e em parcela única.\"","v":"OBS: O valor do benefício mínimo equivale a 10% da URD (R$753,12), caso venha a ser inferior à esse valor, o saldo remanescente será pago à vista e em parcela única."}]
[]
[]
[]
[]
[]
[]
[]
[]
[]
[]
[]
[]
[]
[]
[]
[]
[]
[]
[]
[]
[]
[]
[]
[]
[]
[]
[]
[]
[]
[]
[]
[]
[null,"Veja, abaixo, todas possibilidades de prazo que podem ser escolhidas:"]
[]
[null,"Prazo","Renda Mensal Inicial"]
[null,{"$f":"CALCULOS!B68&\" anos\"","v":"5 anos"},{"$f":"CALCULOS!C68","v":0}]
[null,{"$f":"CALCULOS!B69&\" anos\"","v":"6 anos"},{"$f":"CALCULOS!C69","v":0}]
[null,{"$f":"CALCULOS!B70&\" anos\"","v":"7 anos"},{"$f":"CALCULOS!C70","v":0}]
[null,{"$f":"CALCULOS!B71&\" anos\"","v":"8 anos"},{"$f":"CALCULOS!C71","v":0}]
[null,{"$f":"CALCULOS!B72&\" anos\"","v":"9 anos"},{"$f":"CALCULOS!C72","v":0}]
[null,{"$f":"CALCULOS!B73&\" anos\"","v":"10 anos"},{"$f":"CALCULOS!C73","v":0}]
[null,{"$f":"CALCULOS!B74&\" anos\"","v":"11 anos"},{"$f":"CALCULOS!C74","v":0}]
[null,{"$f":"CALCULOS!B75&\" anos\"","v":"12 anos"},{"$f":"CALCULOS!C75","v":0}]
[null,{"$f":"CALCULOS!B76&\" anos\"","v":"13 anos"},{"$f":"CALCULOS!C76","v":0}]
[null,{"$f":"CALCULOS!B77&\" anos\"","v":"14 anos"},{"$f":"CALCULOS!C77","v":0}]
[null,{"$f":"CALCULOS!B78&\" anos\"","v":"15 anos"},{"$f":"CALCULOS!C78","v":0}]
[null,{"$f":"CALCULOS!B79&\" anos\"","v":"16 anos"},{"$f":"CALCULOS!C79","v":0}]
[null,{"$f":"CALCULOS!B80&\" anos\"","v":"17 anos"},{"$f":"CALCULOS!C80","v":0}]
[null,{"$f":"CALCULOS!B81&\" anos\"","v":"18 anos"},{"$f":"CALCULOS!C81","v":0}]
[null,{"$f":"CALCULOS!B82&\" anos\"","v":"19 anos"},{"$f":"CALCULOS!C82","v":0}]
[null,{"$f":"CALCULOS!B83&\" anos\"","v":"20 anos"},{"$f":"CALCULOS!C83","v":0}]
[null,{"$f":"CALCULOS!B84&\" anos\"","v":"21 anos"},{"$f":"CALCULOS!C84","v":0}]
[null,{"$f":"CALCULOS!B85&\" anos\"","v":"22 anos"},{"$f":"CALCULOS!C85","v":0}]
[null,{"$f":"CALCULOS!B86&\" anos\"","v":"23 anos"},{"$f":"CALCULOS!C86","v":0}]
[null,{"$f":"CALCULOS!B87&\" anos\"","v":"24 anos"},{"$f":"CALCULOS!C87","v":0}]
[null,{"$f":"CALCULOS!B88&\" anos\"","v":"25 anos"},{"$f":"CALCULOS!C88","v":0}]
[null,{"$f":"CALCULOS!B89&\" anos\"","v":"26 anos"},{"$f":"CALCULOS!C89","v":0}]
[null,{"$f":"CALCULOS!B90&\" anos\"","v":"27 anos"},{"$f":"CALCULOS!C90","v":0}]
[null,{"$f":"CALCULOS!B91&\" anos\"","v":"28 anos"},{"$f":"CALCULOS!C91","v":0}]
[null,{"$f":"CALCULOS!B92&\" anos\"","v":"29 anos"},{"$f":"CALCULOS!C92","v":0}]
[null,{"$f":"CALCULOS!B93&\" anos\"","v":"30 anos"},{"$f":"CALCULOS!C93","v":0}]
[]
[null,"Informações Importantes"]
[]
[null,"Os resultados constantes neste simulador não asseguram os saldos de conta projetados e rendas estimadas, pois os valores apresentados correspondem a projeções de resultados do Plano, considerando premissas e critérios previamente definidos. O recebimento das rendas de aposentadoria é condicionado ao encerramento do vínculo empregatício do Participante com a sua Patrocinadora, assim como para recebimento do Resgate e demais Institutos.\nA rentabilidade real dos investimentos dependerá dos resultados obtidos ao longo dos próximos anos. Portanto, as importâncias apresentadas neste simulador constituem apenas uma simulação e não têm validade legal. \nO propósito do simulador é de promover a conscientização da importância do planejamento previdenciário e da formação de poupança, além de servir como uma ferramenta de projeção considerando diferentes cenários (rentabilidade, percentuais contributivos, etc.)."]
[]
[]
[]
[]
[]
[]
[]
[]
[]
[null,{"$f":"\"A taxa de rentabilidade do plano considerada para os cálculos foi de \"&TEXT(DESBAN!$C$33*100,\"0,00\")&\"% ao ano.\"","v":"A taxa de rentabilidade do plano considerada para os cálculos foi de 4,38% ao ano."}]
[]
[null,"Versão: 5.2 (2023)"]
[null,"Desenvolvido por:"]

{"sheet":"SIMULAÇÃO Prazo Indeterminado","index":5,"n_rows":83,"n_cols":5,"rows_kept":83,"cut":false,"hidden":true,"merged":[[23,1,23,2],[23,3,23,4],[25,1,25,2],[25,3,25,4],[26,1,26,2],[26,3,26,4],[22,1,22,2],[20,1,20,2],[20,3,20,4],[21,1,21,2],[21,3,21,4],[22,3,22,4],[18,1,18,2],[18,3,18,4],[11,1,11,2],[11,3,11,4],[17,1,17,2],[13,1,13,2],[14,1,14,2],[15,1,15,2],[16,1,16,2],[13,3,13,4],[14,3,14,4],[15,3,15,4],[16,3,16,4],[17,3,17,4],[27,3,27,4],[28,1,28,2],[28,3,28,4],[29,1,29,2],[29,3,29,4],[27,1,27,2],[35,1,35,2],[37,1,37,4],[40,1,40,2],[42,1,42,2],[44,1,44,2],[66,1,66,2],[54,1,55,2],[54,3,55,4],[68,1,77,4],[78,1,78,4],[57,4,63,4],[53,3,53,4],[47,1,47,2],[49,1,49,2],[51,1,51,2],[53,1,53,2]]}
[]
[]
[]
[]
[]
[]
[]
[]
[]
[]
[]
[null,"Data de Simulação",null,{"$f":"INPUT!C6","v":"2024-08-27"}]
[]
[null,"Nome do Participante / Matrícula",null,{"$f":"INPUT!C8","v":"[ inserir seu nome ]"}]
[null,"Sexo",null,{"$f":"INPUT!C9","v":0}]
[null,"Data de Nascimento",null,{"$f":"INPUT!C10","v":"00:00:00"}]
[null,"Data da Admissão na Patrocinadora",null,{"$f":"INPUT!$C$11","v":"00:00:00"}]
[null,"Data de Inscrição no Plano",null,{"$f":"INPUT!$C$12","v":"00:00:00"}]
[null,"Possuiu Dependente",null,{"$f":"INPUT!$C$13","v":"00:00:00"}]
[]
[null,"Salário de Contribuição",null,{"$f":"INPUT!C17","v":0}]
[null,"Saldo de Conta Total",null,{"$f":"INPUT!C18","v":0}]
[null,"Saldo da Conta de Recursos Portados",null,{"$f":"INPUT!C19","v":0}]
[null,"Contribuição Adicional",null,{"$f":"INPUT!C20","v":0}]
[]
[null,"Idade mínima \n(elegibilidade para Aposentadoria)",null,{"$f":"INPUT!C22","v":55}]
[null,"Idade Desejada para Aposentadoria",null,{"$f":"INPUT!C23","v":0}]
[null,"Tipo de Renda escolhida",null,{"$f":"INPUT!C24","v":"00:00:00"}]
[null,"Resgate Parcial em Parcela Única",null,{"$f":"INPUT!C25","v":0}]
[null,"Quantidade de Parcelas a Receber ao ano",null,{"$f":"INPUT!C26","v":0}]
[]
[]
[]
[null,"Resultados"]
[]
[null,"Aposentadoria e Saldo Acumulado"]
[]
[null,{"$f":"UPPER(IF(AND(CALCULOS!$C$18=0,CALCULOS!$D$18=0,CALCULOS!$E$18=0),\"Você já pode se aposentar!\",\"Você vai se aposentar em \"&IF(CALCULOS!$C$18>0,CALCULOS!$C$18&\" ano\"&IF(CALCULOS!$C$18>1,\"s\",\"\")&IF(AND(CALCULOS!$D$18>0,CALCULOS!$E$18>0),\", \",IF(OR(AND(CALCULOS!$D$18>0,CALCULOS!$E$18=0),AND(CALCULOS!$D$18=0,CALCULOS!$E$18>0)),\" e \",\"\")),\"\")&IF(CALCULOS!$D$18>0,CALCULOS!$D$18&\" mese\"&IF(CALCULOS!$D$18>1,\"s\",\"\")&IF(CALCULOS!$E$18>0,\" e \",\"\"),\"\")&IF(CALCULOS!$E$18>0,CALCULOS!$E$18&\" dia\"&IF(CALCULOS!$E$18>1,\"s\",\"\")&\"\",\"\")&\"!\"))","v":"VOCÊ JÁ PODE SE APOSENTAR!"}]
[]
[]
[null,"Data de Aposentadoria estimada",null,{"$f":"CALC_dt_apo","v":"00:00:00"}]
[]
[null,"Saldos de Conta projetados na Aposentadoria"]
[]
[null,"Conta de Benefícios (TOTAL)",null,{"$f":"CALCULOS!C53","v":0}]
[]
[]
[null,"Renda Financeira de Aposentadoria"]
[]
[null,{"$f":"\"Recebimento em Parcela Única (\"&TEXT(IN_apo_percContaBenef_parcUnica,\"0,00%\")&\")\"","v":"Recebimento em Parcela Única (0,00%)"},null,{"$f":"D45*IN_apo_percContaBenef_parcUnica","v":0}]
[]
[null,"Renda por Prazo Indeterminado"]
[]
[null,"Tipo",null,"Renda Mensal Inicial"]
[null,{"$f":"IF(INPUT!C13=\"Não\",CALCULOS!B132,CALCULOS!B133)","v":"Aposentadoria com reversão em Pensão"},null,{"$f":"IF(INPUT!C13=\"Não\",CALCULOS!C132,CALCULOS!C133)","v":0}]
[]
[]
[null,null,null,null,{"$f":"\"OBS: O valor do benefício mínimo equivale a 10% da URD (R$\"&TEXT(DESBAN!$D$38,\"000,00\")&\"), caso venha a ser inferior à esse valor, o saldo remanescente será pago à vista e em parcela única.\"","v":"OBS: O valor do benefício mínimo equivale a 10% da URD (R$753,12), caso venha a ser inferior à esse valor, o saldo remanescente será pago à vista e em parcela única."}]
[]
[]
[]
[]
[]
[]
[]
[]
[null,"Informações Importantes"]
[]
[null,"Os resultados constantes neste simulador não asseguram os saldos de conta projetados e rendas estimadas, pois os valores apresentados correspondem a projeções de resultados do Plano, considerando premissas e critérios previamente definidos. O recebimento das rendas de aposentadoria é condicionado ao encerramento do vínculo empregatício do Participante com a sua Patrocinadora, assim como para recebimento do Resgate e demais Institutos.\nA rentabilidade real dos investimentos dependerá dos resultados obtidos ao longo dos próximos anos. Portanto, as importâncias apresentadas neste simulador constituem apenas uma simulação e não têm validade legal. \nO propósito do simulador é de promover a conscientização da importância do planejamento previdenciário e da formação de poupança, além de servir como uma ferramenta de projeção considerando diferentes cenários (rentabilidade, percentuais contributivos, etc.)."]
[]
[]
[]
[]
[]
[]
[]
[]
[]
[null,{"$f":"\"A taxa de rentabilidade do plano considerada para os cálculos foi de \"&TEXT(DESBAN!$C$33*100,\"0,00\")&\"% ao ano.\"","v":"A taxa de rentabilidade do plano considerada para os cálculos foi de 4,38% ao ano."}]
[]
[]
[null,"Versão: 5.2 (2023)"]
[null,"Desenvolvido por:"]

{"sheet":"SIMULAÇÃO Percentual do Saldo","index":6,"n_rows":137,"n_cols":5,"rows_kept":137,"cut":false,"hidden":true,"merged":[[89,1,89,4],[122,1,122,2],[29,1,29,2],[29,3,29,4],[35,1,35,2],[37,1,37,4],[51,1,51,3],[40,1,40,2],[42,1,42,2],[44,1,44,2],[47,1,47,2],[49,1,49,2],[27,1,27,2],[27,3,27,4],[28,1,28,2],[28,3,28,4],[88,3,88,5],[56,3,57,4],[25,1,25,2],[23,1,23,2],[23,3,23,4],[25,3,25,4],[26,1,26,2],[26,3,26,4],[18,1,18,2],[18,3,18,4],[124,1,132,4],[133,1,133,4],[13,1,13,2],[14,1,14,2],[16,1,16,2],[17,1,17,2],[16,3,16,4],[17,3,17,4],[22,1,22,2],[20,1,20,2],[20,3,20,4],[21,1,21,2],[21,3,21,4],[22,3,22,4],[11,1,11,2],[11,3,11,4],[13,3,13,4],[14,3,14,4],[15,1,15,2],[15,3,15,4]]}
[]
[]
[]
[]
[]
[]
[]
[]
[]
[]
[]
[null,"Data de Simulação",null,{"$f":"INPUT!C6","v":"2024-08-27"}]
[]
[null,"Nome do Participante / Matrícula",null,{"$f":"INPUT!C8","v":"[ inserir seu nome ]"}]
[null,"Sexo",null,{"$f":"INPUT!C9","v":0}]
[null,"Data de Nascimento",null,{"$f":"INPUT!C10","v":"00:00:00"}]
[null,"Data da Admissão na Patrocinadora",null,{"$f":"INPUT!$C$11","v":"00:00:00"}]
[null,"Data de Inscrição no Plano",null,{"$f":"INPUT!$C$12","v":"00:00:00"}]
[null,"Possuiu Dependente",null,{"$f":"INPUT!$C$13","v":"00:00:00"}]
[]
[null,"Salário de Contribuição",null,{"$f":"INPUT!C17","v":0}]
[null,"Saldo de Conta Total",null,{"$f":"INPUT!C18","v":0}]
[null,"Saldo da Conta de Recursos Portados",null,{"$f":"INPUT!C19","v":0}]
[null,"Contribuição Adicional",null,{"$f":"INPUT!C20","v":0}]
[]
[null,"Idade mínima \n(elegibilidade para Aposentadoria)",null,{"$f":"INPUT!C22","v":55}]
[null,"Idade Desejada para Aposentadoria",null,{"$f":"INPUT!C23","v":0}]
[null,"Tipo de Renda escolhida",null,{"$f":"INPUT!C24","v":"00:00:00"}]
[null,"Resgate Parcial em Parcela Única",null,{"$f":"INPUT!C25","v":0}]
[null,"Quantidade de Parcelas a Receber ao ano",null,{"$f":"INPUT!C26","v":0}]
[]
[]
[]
[null,"Resultados"]
[]
[null,"Aposentadoria e Saldo Acumulado"]
[]
[null,{"$f":"UPPER(IF(AND(CALCULOS!$C$18=0,CALCULOS!$D$18=0,CALCULOS!$E$18=0),\"Você já pode se aposentar!\",\"Você vai se aposentar em \"&IF(CALCULOS!$C$18>0,CALCULOS!$C$18&\" ano\"&IF(CALCULOS!$C$18>1,\"s\",\"\")&IF(AND(CALCULOS!$D$18>0,CALCULOS!$E$18>0),\", \",IF(OR(AND(CALCULOS!$D$18>0,CALCULOS!$E$18=0),AND(CALCULOS!$D$18=0,CALCULOS!$E$18>0)),\" e \",\"\")),\"\")&IF(CALCULOS!$D$18>0,CALCULOS!$D$18&\" mese\"&IF(CALCULOS!$D$18>1,\"s\",\"\")&IF(CALCULOS!$E$18>0,\" e \",\"\"),\"\")&IF(CALCULOS!$E$18>0,CALCULOS!$E$18&\" dia\"&IF(CALCULOS!$E$18>1,\"s\",\"\")&\"\",\"\")&\"!\"))","v":"VOCÊ JÁ PODE SE APOSENTAR!"}]
[]
[]
[null,"Data de Aposentadoria estimada",null,{"$f":"CALC_dt_apo","v":"00:00:00"}]
[]
[null,"Saldos de Conta projetados na Aposentadoria"]
[]
[null,"Conta de Benefícios (TOTAL)",null,{"$f":"CALCULOS!C53","v":0}]
[]
[]
[null,"Renda Financeira de Aposentadoria"]
[]
[null,{"$f":"\"Recebimento em Parcela Única (\"&TEXT(IN_apo_percContaBenef_parcUnica,\"0,00%\")&\")\"","v":"Recebimento em Parcela Única (0,00%)"},null,{"$f":"D45*IN_apo_percContaBenef_parcUnica","v":0}]
[]
[null,"Renda por Percentual do Saldo da Conta de Benefícios"]
[]
[null,"Opção de Renda","Renda Mensal Inicial","Renda após 5 anos","Renda após 15 anos"]
[null,{"$f":"CALCULOS!B99","v":"0,25%"},{"$f":"CALCULOS!C99","v":0},{"$f":"CALCULOS!F99","v":0},{"$f":"CALCULOS!H99","v":0}]
[]
[null,null,null,{"$f":"\"OBS: O valor do benefício mínimo equivale a 10% da URD (R$\"&TEXT(DESBAN!$D$38,\"000,00\")&\"), caso venha a ser inferior à esse valor, o saldo remanescente será pago à vista e em parcela única.\"","v":"OBS: O valor do benefício mínimo equivale a 10% da URD (R$753,12), caso venha a ser inferior à esse valor, o saldo remanescente será pago à vista e em parcela única."}]
[]
[]
[]
[]
[]
[]
[]
[]
[]
[]
[]
[]
[]
[]
[]
[]
[]
[]
[]
[]
[]
[]
[]
[]
[]
[]
[]
[]
[]
[]
[]
[]
[null,"Veja, abaixo, todas possibilidades de percentual que podem ser escolhidas:"]
[]
[null,"Percentual escolhido","Renda Mensal Inicial","Renda após 5 anos","Renda após 15 anos"]
[null,{"$f":"CALCULOS!B100","v":1E-3},{"$f":"CALCULOS!C100","v":0},{"$f":"CALCULOS!F100","v":0},{"$f":"CALCULOS!H100","v":0}]
[null,{"$f":"CALCULOS!B101","v":1.5E-3},{"$f":"CALCULOS!C101","v":0},{"$f":"CALCULOS!F101","v":0},{"$f":"CALCULOS!H101","v":0}]
[null,{"$f":"CALCULOS!B102","v":2E-3},{"$f":"CALCULOS!C102","v":0},{"$f":"CALCULOS!F102","v":0},{"$f":"CALCULOS!H102","v":0}]
[null,{"$f":"CALCULOS!B103","v":2.5000000000000001E-3},{"$f":"CALCULOS!C103","v":0},{"$f":"CALCULOS!F103","v":0},{"$f":"CALCULOS!H103","v":0}]
[null,{"$f":"CALCULOS!B104","v":3.0000000000000001E-3},{"$f":"CALCULOS!C104","v":0},{"$f":"CALCULOS!F104","v":0},{"$f":"CALCULOS!H104","v":0}]
[null,{"$f":"CALCULOS!B105","v":3.5000000000000001E-3},{"$f":"CALCULOS!C105","v":0},{"$f":"CALCULOS!F105","v":0},{"$f":"CALCULOS!H105","v":0}]
[null,{"$f":"CALCULOS!B106","v":4.0000000000000001E-3},{"$f":"CALCULOS!C106","v":0},{"$f":"CALCULOS!F106","v":0},{"$f":"CALCULOS!H106","v":0}]
[null,{"$f":"CALCULOS!B107","v":4.4999999999999997E-3},{"$f":"CALCULOS!C107","v":0},{"$f":"CALCULOS!F107","v":0},{"$f":"CALCULOS!H107","v":0}]
[null,{"$f":"CALCULOS!B108","v":5.0000000000000001E-3},{"$f":"CALCULOS!C108","v":0},{"$f":"CALCULOS!F108","v":0},{"$f":"CALCULOS!H108","v":0}]
[null,{"$f":"CALCULOS!B109","v":5.4999999999999997E-3},{"$f":"CALCULOS!C109","v":0},{"$f":"CALCULOS!F109","v":0},{"$f":"CALCULOS!H109","v":0}]
[null,{"$f":"CALCULOS!B110","v":6.0000000000000001E-3},{"$f":"CALCULOS!C110","v":0},{"$f":"CALCULOS!F110","v":0},{"$f":"CALCULOS!H110","v":0}]
[null,{"$f":"CALCULOS!B111","v":6.4999999999999997E-3},{"$f":"CALCULOS!C111","v":0},{"$f":"CALCULOS!F111","v":0},{"$f":"CALCULOS!H111","v":0}]
[null,{"$f":"CALCULOS!B112","v":7.0000000000000001E-3},{"$f":"CALCULOS!C112","v":0},{"$f":"CALCULOS!F112","v":0},{"$f":"CALCULOS!H112","v":0}]
[null,{"$f":"CALCULOS!B113","v":7.4999999999999997E-3},{"$f":"CALCULOS!C113","v":0},{"$f":"CALCULOS!F113","v":0},{"$f":"CALCULOS!H113","v":0}]
[null,{"$f":"CALCULOS!B114","v":8.0000000000000002E-3},{"$f":"CALCULOS!C114","v":0},{"$f":"CALCULOS!F114","v":0},{"$f":"CALCULOS!H114","v":0}]
[null,{"$f":"CALCULOS!B115","v":8.5000000000000006E-3},{"$f":"CALCULOS!C115","v":0},{"$f":"CALCULOS!F115","v":0},{"$f":"CALCULOS!H115","v":0}]
[null,{"$f":"CALCULOS!B116","v":8.9999999999999993E-3},{"$f":"CALCULOS!C116","v":0},{"$f":"CALCULOS!F116","v":0},{"$f":"CALCULOS!H116","v":0}]
[null,{"$f":"CALCULOS!B117","v":9.4999999999999998E-3},{"$f":"CALCULOS!C117","v":0},{"$f":"CALCULOS!F117","v":0},{"$f":"CALCULOS!H117","v":0}]
[null,{"$f":"CALCULOS!B118","v":0.01},{"$f":"CALCULOS!C118","v":0},{"$f":"CALCULOS!F118","v":0},{"$f":"CALCULOS!H118","v":0}]
[null,{"$f":"CALCULOS!B119","v":1.0500000000000001E-2},{"$f":"CALCULOS!C119","v":0},{"$f":"CALCULOS!F119","v":0},{"$f":"CALCULOS!H119","v":0}]
[null,{"$f":"CALCULOS!B120","v":1.0999999999999999E-2},{"$f":"CALCULOS!C120","v":0},{"$f":"CALCULOS!F120","v":0},{"$f":"CALCULOS!H120","v":0}]
[null,{"$f":"CALCULOS!B121","v":1.15E-2},{"$f":"CALCULOS!C121","v":0},{"$f":"CALCULOS!F121","v":0},{"$f":"CALCULOS!H121","v":0}]
[null,{"$f":"CALCULOS!B122","v":1.2E-2},{"$f":"CALCULOS!C122","v":0},{"$f":"CALCULOS!F122","v":0},{"$f":"CALCULOS!H122","v":0}]
[null,{"$f":"CALCULOS!B123","v":1.2500000000000001E-2},{"$f":"CALCULOS!C123","v":0},{"$f":"CALCULOS!F123","v":0},{"$f":"CALCULOS!H123","v":0}]
[null,{"$f":"CALCULOS!B124","v":1.2999999999999999E-2},{"$f":"CALCULOS!C124","v":0},{"$f":"CALCULOS!F124","v":0},{"$f":"CALCULOS!H124","v":0}]
[null,{"$f":"CALCULOS!B125","v":1.35E-2},{"$f":"CALCULOS!C125","v":0},{"$f":"CALCULOS!F125","v":0},{"$f":"CALCULOS!H125","v":0}]
[null,{"$f":"CALCULOS!B126","v":1.4E-2},{"$f":"CALCULOS!C126","v":0},{"$f":"CALCULOS!F126","v":0},{"$f":"CALCULOS!H126","v":0}]
[null,{"$f":"CALCULOS!B127","v":1.4500000000000001E-2},{"$f":"CALCULOS!C127","v":0},{"$f":"CALCULOS!F127","v":0},{"$f":"CALCULOS!H127","v":0}]
[null,{"$f":"CALCULOS!B128","v":1.4999999999999999E-2},{"$f":"CALCULOS!C128","v":0},{"$f":"CALCULOS!F128","v":0},{"$f":"CALCULOS!H128","v":0}]
[]
[null,"Informações Importantes"]
[]
[null,"Os resultados constantes neste simulador não asseguram os saldos de conta projetados e rendas estimadas, pois os valores apresentados correspondem a projeções de resultados do Plano, considerando premissas e critérios previamente definidos. O recebimento das rendas de aposentadoria é condicionado ao encerramento do vínculo empregatício do Participante com a sua Patrocinadora, assim como para recebimento do Resgate e demais Institutos.\nA rentabilidade real dos investimentos dependerá dos resultados obtidos ao longo dos próximos anos. Portanto, as importâncias apresentadas neste simulador constituem apenas uma simulação e não têm validade legal. \nO propósito do simulador é de promover a conscientização da importância do planejamento previdenciário e da formação de poupança, além de servir como uma ferramenta de projeção considerando diferentes cenários (rentabilidade, percentuais contributivos, etc.)."]
[]
[]
[]
[]
[]
[]
[]
[]
[null,{"$f":"\"A taxa de rentabilidade do plano considerada para os cálculos foi de \"&TEXT(DESBAN!$C$33*100,\"0,00\")&\"% ao ano.\"","v":"A taxa de rentabilidade do plano considerada para os cálculos foi de 4,38% ao ano."}]
[]
[null,"Versão: 5.2 (2023)"]
[null,"Desenvolvido por:"]

{"sheet":"SIMULAÇÃO Renda Vitalícia","index":7,"n_rows":82,"n_cols":5,"rows_kept":82,"cut":false,"hidden":true,"merged":[[11,3,11,4],[13,1,13,2],[14,1,14,2],[15,1,15,2],[16,1,16,2],[11,1,11,2],[13,3,13,4],[14,3,14,4],[15,3,15,4],[16,3,16,4],[18,1,18,2],[18,3,18,4],[17,1,17,2],[17,3,17,4],[23,1,23,2],[23,3,23,4],[22,1,22,2],[20,1,20,2],[20,3,20,4],[21,1,21,2],[21,3,21,4],[22,3,22,4],[25,1,25,2],[25,3,25,4],[26,1,26,2],[26,3,26,4],[27,1,27,2],[27,3,27,4],[28,1,28,2],[28,3,28,4],[29,1,29,2],[29,3,29,4],[35,1,35,2],[65,1,76,4],[77,1,77,4],[37,1,37,4],[40,1,40,2],[42,1,42,2],[44,1,44,2],[47,1,47,2],[49,1,49,2],[53,1,53,2],[63,1,63,2],[54,1,55,2],[54,3,55,3],[58,4,63,4]]}
[]
[]
[]
[]
[]
[]
[]
[]
[]
[]
[]
[null,"Data de Simulação",null,{"$f":"INPUT!C6","v":"2024-08-27"}]
[]
[null,"Nome do Participante / Matrícula",null,{"$f":"INPUT!C8","v":"[ inserir seu nome ]"}]
[null,"Sexo",null,{"$f":"INPUT!C9","v":0}]
[null,"Data de Nascimento",null,{"$f":"INPUT!C10","v":"00:00:00"}]
[null,"Data da Admissão na Patrocinadora",null,{"$f":"INPUT!$C$11","v":"00:00:00"}]
[null,"Data de Inscrição no Plano",null,{"$f":"INPUT!$C$12","v":"00:00:00"}]
[null,"Possuiu Dependente",null,{"$f":"INPUT!$C$13","v":"00:00:00"}]
[]
[null,"Salário de Contribuição",null,{"$f":"INPUT!C17","v":0}]
[null,"Saldo de Conta Total",null,{"$f":"INPUT!C18","v":0}]
[null,"Saldo da Conta de Recursos Portados",null,{"$f":"INPUT!C19","v":0}]
[null,"Contribuição Adicional",null,{"$f":"INPUT!C20","v":0}]
[]
[null,"Idade mínima \n(elegibilidade para Aposentadoria)",null,{"$f":"INPUT!C22","v":55}]
[null,"Idade Desejada para Aposentadoria",null,{"$f":"INPUT!C23","v":0}]
[null,"Tipo de Renda escolhida",null,{"$f":"INPUT!C24","v":"00:00:00"}]
[null,"Resgate Parcial em Parcela Única",null,{"$f":"INPUT!C25","v":0}]
[null,"Quantidade de Parcelas a Receber ao ano",null,{"$f":"INPUT!C26","v":0}]
[]
[]
[]
[null,"Resultados"]
[]
[null,"Aposentadoria e Saldo Acumulado"]
[]
[null,{"$f":"UPPER(IF(AND(CALCULOS!$C$18=0,CALCULOS!$D$18=0,CALCULOS!$E$18=0),\"Você já pode se aposentar!\",\"Você vai se aposentar em \"&IF(CALCULOS!$C$18>0,CALCULOS!$C$18&\" ano\"&IF(CALCULOS!$C$18>1,\"s\",\"\")&IF(AND(CALCULOS!$D$18>0,CALCULOS!$E$18>0),\", \",IF(OR(AND(CALCULOS!$D$18>0,CALCULOS!$E$18=0),AND(CALCULOS!$D$18=0,CALCULOS!$E$18>0)),\" e \",\"\")),\"\")&IF(CALCULOS!$D$18>0,CALCULOS!$D$18&\" mese\"&IF(CALCULOS!$D$18>1,\"s\",\"\")&IF(CALCULOS!$E$18>0,\" e \",\"\"),\"\")&IF(CALCULOS!$E$18>0,CALCULOS!$E$18&\" dia\"&IF(CALCULOS!$E$18>1,\"s\",\"\")&\"\",\"\")&\"!\"))","v":"VOCÊ JÁ PODE SE APOSENTAR!"}]
[]
[]
[null,"Data de Aposentadoria estimada",null,{"$f":"CALC_dt_apo","v":"00:00:00"}]
[]
[null,"Saldos de Conta projetados na Aposentadoria"]
[]
[null,"Conta de Benefícios (TOTAL)",null,{"$f":"CALCULOS!C53","v":0}]
[]
[]
[null,"Renda de Aposentadoria"]
[]
[null,{"$f":"\"Recebimento em Parcela Única (\"&TEXT(IN_apo_percContaBenef_parcUnica,\"0,00%\")&\")\"","v":"Recebimento em Parcela Única (0,00%)"},null,{"$f":"D45*IN_apo_percContaBenef_parcUnica","v":0}]
[]
[null,"Renda Vitalícia"]
[]
[null,"Tipo",null,"Renda Mensal Inicial"]
[null,{"$f":"IF(INPUT!C13=\"Não\",CALCULOS!B166,CALCULOS!B167)","v":"Aposentadoria com reversão em Pensão"},null,{"$f":"IF(INPUT!C13=\"Não\",CALCULOS!C166,CALCULOS!C167)","v":0}]
[]
[]
[]
[null,null,null,null,{"$f":"\"OBS: O valor do benefício mínimo equivale a 10% da URD (R$\"&TEXT(DESBAN!$D$38,\"000,00\")&\"), caso venha a ser inferior à esse valor, o saldo remanescente será pago à vista e em parcela única.\"","v":"OBS: O valor do benefício mínimo equivale a 10% da URD (R$753,12), caso venha a ser inferior à esse valor, o saldo remanescente será pago à vista e em parcela única."}]
[]
[]
[]
[]
[null,"Informações Importantes"]
[]
[null,"Os resultados constantes neste simulador não asseguram os saldos de conta projetados e rendas estimadas, pois os valores apresentados correspondem a projeções de resultados do Plano, considerando premissas e critérios previamente definidos. O recebimento das rendas de aposentadoria é condicionado ao encerramento do vínculo empregatício do Participante com a sua Patrocinadora, assim como para recebimento do Resgate e demais Institutos.\nA rentabilidade real dos investimentos dependerá dos resultados obtidos ao longo dos próximos anos. Portanto, as importâncias apresentadas neste simulador constituem apenas uma simulação e não têm validade legal. \nO propósito do simulador é de promover a conscientização da importância do planejamento previdenciário e da formação de poupança, além de servir como uma ferramenta de projeção considerando diferentes cenários (rentabilidade, percentuais contributivos, etc.)."]
[]
[]
[]
[]
[]
[]
[]
[]
[]
[]
[]
[null,{"$f":"\"A taxa de rentabilidade do plano considerada para os cálculos foi de \"&TEXT(DESBAN!$C$33*100,\"0,00\")&\"% ao ano.\"","v":"A taxa de rentabilidade do plano considerada para os cálculos foi de 4,38% ao ano."}]
[]
[]
[null,"Versão: 5.2 (2023)"]
[null,"Desenvolvido por:"]

{"sheet":"CALCULOS","index":8,"n_rows":176,"n_cols":11,"rows_kept":176,"cut":false,"hidden":true,"merged":[]}
[]
[null,"Cálculos"]
[]
[null,"Idade mínima",{"$f":"PAR_Idade_Apo_Antecipada","v":55},null,null,null,"Check tempo mín. plano"]
[null,"Tempo mínimo Plano",{"$f":"PAR_carencia_plano","v":10},null,null,"data aposentadoria",{"$f":"DATE(YEAR(IN_dtNasc)+INPUT!C23,MONTH(IN_dtNasc),DAY(IN_dtNasc))","v":"00:00:00"}]
[null,null,null,null,null,"data insc. Plano",{"$f":"IN_dtINSC","v":"00:00:00"}]
[null,"Idade aposentadoria mínima (elegibilidade)",{"$f":"CALC_idade_mínima","v":55},"(em anos)",null,"tempo de plano",{"$f":"DATEDIF(IN_dtINSC,CALCULOS!G5,\"Y\")","v":0}]
[null,"Idade aposentadoria mínima (elegibilidade)",{"$f":"CALC_idade_mínima*12","v":660},"(em meses)"]
[]
[]
[null,"Cálculos preliminares"]
[null,"Tempos"]
[null,null,"Ano","Mês","Dia","Em meses","Em anos"]
[null,"Idade",{"$f":"DATEDIF(IN_dtNasc,IN_dtSimul,\"y\")","v":124},{"$f":"DATEDIF(IN_dtNasc,IN_dtSimul,\"m\")-C14*12","v":7},{"$f":"DATEDIF(EDATE(IN_dtNasc,C14*12+D14),IN_dtSimul,\"d\")","v":27},{"$f":"C14*12+D14+IF(E14>15,1,0)","v":1496},{"$f":"C14+IF(D14+IF(E14>15,1,0)>=6,1,0)","v":125}]
[null,"Tempo Patroc",{"$f":"DATEDIF(IN_dtAdmPatroc,IN_dtSimul,\"y\")","v":124},{"$f":"DATEDIF(IN_dtAdmPatroc,IN_dtSimul,\"m\")-C15*12","v":7},{"$f":"DATEDIF(EDATE(IN_dtAdmPatroc,C15*12+D15),IN_dtSimul,\"d\")","v":27},1496,125]
[null,"Tempo Plano",{"$f":"DATEDIF(IN_dtInscPlano,IN_dtSimul,\"y\")","v":124},{"$f":"DATEDIF(IN_dtInscPlano,IN_dtSimul,\"m\")-C16*12","v":7},{"$f":"DATEDIF(EDATE(IN_dtInscPlano,C16*12+D16),IN_dtSimul,\"d\")","v":27},1496,125]
[null,"Idade Aposentadoria",{"$f":"DATEDIF(IN_dtNasc,CALC_dt_apo,\"y\")","v":0},{"$f":"DATEDIF(IN_dtNasc,CALC_dt_apo,\"m\")-C17*12","v":0},{"$f":"DATEDIF(EDATE(IN_dtNasc,C17*12+D17),CALC_dt_apo,\"d\")","v":0},0,0]
[null,"Contribuições futuras (Participante) - APO",{"$f":"IFERROR(DATEDIF(IN_dtSimul,CALC_dt_apo,\"y\"),0)","v":0},{"$f":"IFERROR(DATEDIF(IN_dtSimul,CALC_dt_apo,\"m\")-C18*12,0)","v":0},{"$f":"IFERROR(DATEDIF(EDATE(IN_dtSimul,C18*12+D18),CALC_dt_apo,\"d\"),0)","v":0},{"$f":"C18*12+D18+IF(E18>15,1,0)","v":0},0]
[null,"Contribuições futuras (Patrocinadora) - APO",{"$f":"IFERROR(DATEDIF(IN_dtSimul,CALC_dt_final_patroc,\"y\"),0)","v":0},{"$f":"IFERROR(DATEDIF(IN_dtSimul,CALC_dt_final_patroc,\"m\")-C19*12,0)","v":0},{"$f":"IFERROR(DATEDIF(EDATE(IN_dtSimul,C19*12+D19),CALC_dt_final_patroc,\"d\"),0)","v":0},0,0]
[]
[null,"Dt. Aposentadoria Normal (Desejada)",{"$f":"EDATE(IN_dtNasc,MAX(INPUT!C23*12,INPUT!C23))","v":"00:00:00"}]
[null,"Dt. Aposentadoria Antecipada",{"$f":"EDATE(IN_dtNasc,MAX(IN_apo_idade*12,C7))","v":"1954-12-31"}]
[null,"Dt. Final contrib. Patroc",{"$f":"CALC_dt_apo","v":"00:00:00"}]
[]
[null,"Sexo",{"$f":"IF(OR(IN_sexo=\"M\",IN_sexo=\"Masculino\"),\"M\",IF(OR(IN_sexo=\"F\",IN_sexo=\"Feminino\"),\"F\",\"ERRO\"))","v":"ERRO"}]
[null,"Tx. Rentabilidade (anual)",{"$f":"DESBAN!C33","v":4.3799999999999999E-2}]
[null,"Tx. Rentabilidade (mensal)",{"$f":"(1+C26)^(1/12)-1","v":3.5787133767835044E-3}]
[null,"Tx. Cresc. Salarial (anual)",{"$f":"DESBAN!C34","v":5.0000000000000001E-3}]
[null,"Tx. Cresc. Salarial (mensal)",{"$f":"(1+C28)^(1/12)-1","v":4.1571484472902043E-4}]
[]
[]
[null,"Contribuição Básica",{"$f":"(MIN(MAX(0,PAR_salario_partic-DESBAN!B23),DESBAN!C23-DESBAN!B23)*DESBAN!D23+MIN(MAX(0,PAR_salario_partic-DESBAN!C23),DESBAN!C24-DESBAN!B24)*DESBAN!D24+MIN(MAX(0,PAR_salario_partic-DESBAN!C24),DESBAN!C25-DESBAN!B25)*DESBAN!D25)","v":0},"% considerado até R$ 31.160,07 de renda"]
[null,"Contribuição Normal - Patrocinadora",{"$f":"C32","v":0}]
[]
[null,"Contribuições e saldos atuais"]
[null,"Total"]
[null,"Saldo de Conta Total (atual)",{"$f":"IN_ContaTotal+IN_ContaRecPortados","v":0}]
[null,"Salário Total",{"$f":"IN_SalContrib","v":0}]
[null,"Salário de Participação considerado no Cálculo",{"$f":"PAR_salario_partic","v":0}]
[null,"Contribuição Básica",{"$f":"C32","v":0}]
[null,"Contribuição Patrocinadora",{"$f":"C33","v":0}]
[null,"Contribuição Voluntária",{"$f":"IN_ContribAdicional*$C$39","v":0}]
[null,"Tx. Carreg Partic",{"$f":"-C40*PAR_tx_carreg","v":0}]
[null,"Tx. Carreg Patroc",{"$f":"-C41*PAR_tx_carreg","v":0}]
[null,"Tx. Risco Partic",{"$f":"-C40*DESBAN!C7","v":0}]
[null,"Tx. Risco Patroc",{"$f":"-C41*DESBAN!C7","v":0}]
[null,"Contribuição total líquida",{"$f":"SUM(C40:C46)","v":0}]
[]
[null,"Saldos projetados na aposentadoria"]
[null,"TOTAL"]
[null,"Saldo atual projetado",{"$f":"FV($C$27,$F$18,0,-$C$37,0)","v":0}]
[null,"Contribuições Futuras",{"$f":"(POWER(1+$C$28,$F$18/12)*POWER(1+$C$27,-$F$18)-1)/($C$28-$C$26)*FV($C$27,12,-1)*POWER(1+$C$27,$F$18)*$C$47*(13/12)","v":0}]
[null,"TOTAL",{"$f":"FLUXO!G5","v":0},{"$f":"SUM(C51:C52)-C53","v":0}]
[]
[null,"Simulações de renda financeira"]
[null,"Conta de benefícios projetada"]
[null,"Conta de benefícios",{"$f":"C53","v":0}]
[null,"Recebimento parcela única",{"$f":"C57*IN_apo_percContaBenef_parcUnica","v":0}]
[null,"Conta de benefícios para renda",{"$f":"C57-C58","v":0}]
[]
[]
[null,"Renda por Prazo Determinado"]
[null,"Prazo escolhido (em anos)",{"$f":"INPUT!C28","v":10},null,"t (em anos)","Saldo Acumulado","Renda Recalculada"]
[null,"Prazo escolhido (em meses)",{"$f":"C63*PAR_n_benef","v":0},"1º ano",0,{"$f":"C59","v":0},{"$f":"C67","v":0},{"$f":"IFERROR(PMT($C$27,$C$64,-$C$59,0,0),0)","v":0}]
[null,null,null,"2º ano",1,{"$f":"IF($C$63<E65,\"-\",FV($C$27,12,G64*PAR_n_benef/12,-F64))","v":0},{"$f":"IFERROR(F65/($C$64-(PAR_n_benef*E65)),\"-\")","v":"-"}]
[null,"Prazo","Renda Mensal (inicial)","3º ano",2,{"$error":"#VALUE!"},"-"]
[null,{"$f":"TEXT(C63,\"##\")&\" anos\"","v":"10 anos"},{"$f":"IFERROR($C$59/$C$64,0)","v":0},"4º ano",3,{"$error":"#VALUE!"},"-"]
[null,5,{"$f":"IFERROR($C$59/(B68*PAR_n_benef),0)","v":0},"5º ano",4,{"$error":"#VALUE!"},"-"]
[null,6,0,"6º ano",5,{"$error":"#VALUE!"},"-"]
[null,7,0,"7º ano",6,{"$error":"#VALUE!"},"-"]
[null,8,0,"8º ano",7,{"$error":"#VALUE!"},"-"]
[null,9,0,"9º ano",8,{"$error":"#VALUE!"},"-"]
[null,10,0,"10º ano",9,{"$error":"#VALUE!"},"-"]
[null,11,0,"11º ano",10,{"$error":"#VALUE!"},"-"]
[null,12,0,"12º ano",11,"-","-"]
[null,13,0,"13º ano",12,"-","-"]
[null,14,0,"14º ano",13,"-","-"]
[null,15,0,"15º ano",14,"-","-"]
[null,16,0,"16º ano",15,"-","-"]
[null,17,0,"17º ano",16,"-","-"]
[null,18,0,"18º ano",17,"-","-"]
[null,19,0,"19º ano",18,"-","-"]
[null,20,0,"20º ano",19,"-","-"]
[null,21,0,"21º ano",20,"-","-"]
[null,22,0,"22º ano",21,{"$f":"IF($C$63<E85,\"-\",FV($C$27,12,G84*PAR_n_benef/12,-F84))","v":"-"},{"$f":"IFERROR(F85/($C$64-(PAR_n_benef*E85)),\"-\")","v":"-"}]
[null,23,0,"23º ano",22,"-","-"]
[null,24,0,"24º ano",23,"-","-"]
[null,25,0,"25º ano",24,"-","-"]
[null,26,0,"26º ano",25,"-","-"]
[null,27,0,"27º ano",26,"-","-"]
[null,28,0,"28º ano",27,"-","-"]
[null,29,0,"29º ano",28,"-","-"]
[null,30,0,"30º ano",29,"-","-"]
[]
[null,"Renda por Percentual do Saldo da Conta de Benefícios"]
[null,"Percentual escolhido",{"$f":"INPUT!C29","v":2.5000000000000001E-3}]
[]
[null,"%","Renda Mensal (inicial)","Fator rendimento","Quantidade de parcelas prováveis","Renda Mensal (após 5 anos)","Renda Mensal (após 10 anos)","Renda Mensal (após 15 anos)","Renda Mensal (após 20 anos)"]
[null,{"$f":"TEXT(C96*100,\"0,00\")&\"%\"","v":"0,25%"},{"$f":"$C$59*C96","v":0},{"$f":"(1+$C$27)*(1-C96)-1","v":1.0697665933416811E-3},{"$f":"IFERROR(IF(D99>=0,\"Indeterminado\",(NPER(D99,0,-$C$59,PAR_UR_mínimo,0))),0)","v":"Indeterminado"},{"$f":"FV($D99,5*12,,-$C$59,0)*$C96","v":0},{"$f":"FV($D99,10*12,,-$C$59,0)*$C96","v":0},{"$f":"FV($D99,15*12,,-$C$59,0)*$C96","v":0},{"$f":"FV($D99,20*12,,-$C$59,0)*$C96","v":0}]
[null,1E-3,{"$f":"$C$59*B100","v":0},{"$f":"(1+$C$27)*(1-B100)-1","v":2.5751346634066419E-3},"Indeterminado",{"$f":"FV($D100,5*12,,-$C$59,0)*$B100","v":0},{"$f":"FV($D100,10*12,,-$C$59,0)*$B100","v":0},{"$f":"FV($D100,15*12,,-$C$59,0)*$B100","v":0},{"$f":"FV($D100,20*12,,-$C$59,0)*$B100","v":0}]
[null,1.5E-3,{"$f":"$C$59*B101","v":0},{"$f":"(1+$C$27)*(1-B101)-1","v":2.0733453067183216E-3},"Indeterminado",{"$f":"FV($D101,5*12,,-$C$59,0)*$B101","v":0},{"$f":"FV($D101,10*12,,-$C$59,0)*$B101","v":0},{"$f":"FV($D101,15*12,,-$C$59,0)*$B101","v":0},{"$f":"FV($D101,20*12,,-$C$59,0)*$B101","v":0}]
[null,2E-3,0,{"$f":"(1+$C$27)*(1-B102)-1","v":1.5715559500300014E-3},"Indeterminado",0,0,0,0]
[null,2.5000000000000001E-3,0,1.0697665933416811E-3,"Indeterminado",0,0,0,0]
[null,3.0000000000000001E-3,0,5.6797723665313882E-4,"Indeterminado",0,0,0,0]
[null,3.5000000000000001E-3,0,6.6187879964818563E-5,"Indeterminado",0,0,0,0]
[null,4.0000000000000001E-3,0,{"$f":"(1+$C$27)*(1-B106)-1","v":-4.3560147672361271E-4},0,0,0,0,0]
[null,4.4999999999999997E-3,0,-9.3739083341193297E-4,0,0,0,0,0]
[null,5.0000000000000001E-3,0,-1.4391801901003642E-3,0,0,0,0,0]
[null,5.4999999999999997E-3,0,-1.9409695467887955E-3,0,0,0,0,0]
[null,6.0000000000000001E-3,0,-2.4427589034772268E-3,0,0,0,0,0]
[null,6.4999999999999997E-3,0,-2.944548260165547E-3,{"$f":"IFERROR(IF(D111>=0,\"Indeterminado\",(NPER(D111,0,-$C$59,PAR_UR_mínimo,0))),0)","v":0},0,0,0,0]
[null,7.0000000000000001E-3,0,-3.4463376168539783E-3,0,0,0,0,0]
[null,7.4999999999999997E-3,0,-3.9481269735422986E-3,0,0,0,0,0]
[null,8.0000000000000002E-3,0,-4.4499163302307299E-3,0,0,0,0,0]
[null,8.5000000000000006E-3,0,-4.9517056869191611E-3,0,0,0,0,0]
[null,8.9999999999999993E-3,0,-5.4534950436075924E-3,0,0,0,0,0]
[null,9.4999999999999998E-3,0,-5.9552844002959127E-3,0,0,0,0,0]
[null,0.01,{"$f":"$C$59*B118","v":0},{"$f":"(1+$C$27)*(1-B118)-1","v":-6.4570737569843439E-3},0,{"$f":"FV($D118,5*12,,-$C$59,0)*$B118","v":0},{"$f":"FV($D118,10*12,,-$C$59,0)*$B118","v":0},{"$f":"FV($D118,15*12,,-$C$59,0)*$B118","v":0},{"$f":"FV($D118,20*12,,-$C$59,0)*$B118","v":0}]
[null,1.0500000000000001E-2,{"$f":"$C$59*B119","v":0},-6.9588631136726642E-3,0,{"$f":"FV($D119,5*12,,-$C$59,0)*$B119","v":0},{"$f":"FV($D119,10*12,,-$C$59,0)*$B119","v":0},{"$f":"FV($D119,15*12,,-$C$59,0)*$B119","v":0},{"$f":"FV($D119,20*12,,-$C$59,0)*$B119","v":0}]
[null,1.0999999999999999E-2,0,-7.4606524703610955E-3,0,0,0,0,0]
[null,1.15E-2,0,-7.9624418270494157E-3,0,0,0,0,0]
[null,1.2E-2,0,-8.464231183737958E-3,0,0,0,0,0]
[null,1.2500000000000001E-2,0,-8.9660205404262783E-3,0,0,0,0,0]
[null,1.2999999999999999E-2,0,-9.4678098971147095E-3,0,0,0,0,0]
[null,1.35E-2,0,-9.9695992538030298E-3,0,0,0,0,0]
[null,1.4E-2,0,-1.0471388610491461E-2,0,0,0,0,0]
[null,1.4500000000000001E-2,0,-1.0973177967179781E-2,0,0,0,0,0]
[null,1.4999999999999999E-2,{"$f":"$C$59*B128","v":0},-1.1474967323868213E-2,0,{"$f":"FV($D128,5*12,,-$C$59,0)*$B128","v":0},{"$f":"FV($D128,10*12,,-$C$59,0)*$B128","v":0},{"$f":"FV($D128,15*12,,-$C$59,0)*$B128","v":0},{"$f":"FV($D128,20*12,,-$C$59,0)*$B128","v":0}]
[]
[null,"Renda por Prazo Indeterminado"]
[null,"Tipo","Renda Mensal (inicial)","Sobrevida"]
[null,"Aposentadoria sem reversão em Pensão",{"$f":"IFERROR($C$59/(PAR_parcelas_ao_ano_benef*VLOOKUP($G$17,PAR_TAB_FATORES_ATUARIAIS,IF($C$25=\"M\",2,IF($C$25=\"F\",3,\"ERRO\")),0)),0)","v":0},{"$f":"IFERROR(ROUND(VLOOKUP(G17,DESBAN!$B$43:$L$164,IF(C25=\"M\",10,11),0),0),0)","v":88}]
[null,"Aposentadoria com reversão em Pensão",{"$f":"IFERROR($C$59/(PAR_parcelas_ao_ano_benef*VLOOKUP($G$17,PAR_TAB_FATORES_ATUARIAIS,IF($C$25=\"M\",4,IF($C$25=\"F\",5,\"ERRO\")),0)),0)","v":0},{"$f":"D132","v":88}]
[]
[]
[null,"Anos","Sem reversão em pensão","Com reversão em pensão (estimada)",null,"t (em anos)","Saldo Acumulado","Sem reversão em pensão","Saldo Acumulado","Com reversão em pensão (estimada)","Renda Escolhida"]
[null,55,{"$f":"IFERROR($C$59/(PAR_parcelas_ao_ano_benef*VLOOKUP(B137,PAR_TAB_FATORES_ATUARIAIS,IF($C$25=\"M\",2,IF($C$25=\"F\",3,\"ERRO\")),0)),0)","v":0},{"$f":"IFERROR($C$59/(PAR_parcelas_ao_ano_benef*VLOOKUP(B137,PAR_TAB_FATORES_ATUARIAIS,IF($C$25=\"M\",4,IF($C$25=\"F\",5,\"ERRO\")),0)),0)","v":0},null,0,{"$f":"C53","v":0},{"$f":"G137/(PAR_parcelas_ao_ano_benef*VLOOKUP($G$17,PAR_TAB_FATORES_ATUARIAIS,IF($C$25=\"M\",2,IF($C$25=\"F\",3,\"ERRO\")),0))","v":{"$error":"#VALUE!"}},{"$f":"C53","v":0},{"$f":"I137/(PAR_parcelas_ao_ano_benef*VLOOKUP($G$17,PAR_TAB_FATORES_ATUARIAIS,IF($C$25=\"M\",4,IF($C$25=\"F\",5,\"ERRO\")),0))","v":{"$error":"#VALUE!"}},{"$f":"IF(F137>$D$132,0,IF(INPUT!$C$13=\"Não\",CALCULOS!H137,CALCULOS!J137))","v":{"$error":"#VALUE!"}}]
[null,56,0,0,null,1,{"$f":"((((((((((((G137*(1+$C$27)-H137)*(1+$C$27)-H137)*(1+$C$27)-H137)*(1+$C$27)-H137)*(1+$C$27)-H137)*(1+$C$27)-H137)*(1+$C$27)-H137)*(1+$C$27)-H137)*(1+$C$27)-H137)*(1+$C$27)-H137)*(1+$C$27)-H137)*(1+$C$27)-H137*IF(PAR_n_benef=13,2,1))","v":{"$error":"#VALUE!"}},{"$f":"G138/(PAR_parcelas_ao_ano_benef*VLOOKUP($G$17,PAR_TAB_FATORES_ATUARIAIS,IF($C$25=\"M\",2,IF($C$25=\"F\",3,\"ERRO\")),0))","v":{"$error":"#VALUE!"}},{"$f":"((((((((((((I137*(1+$C$27)-J137)*(1+$C$27)-J137)*(1+$C$27)-J137)*(1+$C$27)-J137)*(1+$C$27)-J137)*(1+$C$27)-J137)*(1+$C$27)-J137)*(1+$C$27)-J137)*(1+$C$27)-J137)*(1+$C$27)-J137)*(1+$C$27)-J137)*(1+$C$27)-J137*IF(PAR_n_benef=13,2,1))","v":{"$error":"#VALUE!"}},{"$error":"#VALUE!"},{"$f":"IF(F138>$D$132,0,IF(INPUT!$C$13=\"Não\",CALCULOS!H138,CALCULOS!J138))","v":{"$error":"#VALUE!"}}]
[null,57,0,0,null,2,{"$error":"#VALUE!"},{"$error":"#VALUE!"},{"$error":"#VALUE!"},{"$error":"#VALUE!"},{"$f":"IF(F139>$D$132,0,IF(INPUT!$C$13=\"Não\",CALCULOS!H139,CALCULOS!J139))","v":{"$error":"#VALUE!"}}]
[null,58,0,0,null,3,{"$error":"#VALUE!"},{"$error":"#VALUE!"},{"$error":"#VALUE!"},{"$error":"#VALUE!"},{"$f":"IF(F140>$D$132,0,IF(INPUT!$C$13=\"Não\",CALCULOS!H140,CALCULOS!J140))","v":{"$error":"#VALUE!"}}]
[null,59,0,0,null,4,{"$error":"#VALUE!"},{"$error":"#VALUE!"},{"$error":"#VALUE!"},{"$error":"#VALUE!"},{"$f":"IF(F141>$D$132,0,IF(INPUT!$C$13=\"Não\",CALCULOS!H141,CALCULOS!J141))","v":{"$error":"#VALUE!"}}]
[null,60,0,0,null,5,{"$error":"#VALUE!"},{"$error":"#VALUE!"},{"$error":"#VALUE!"},{"$error":"#VALUE!"},{"$f":"IF(F142>$D$132,0,IF(INPUT!$C$13=\"Não\",CALCULOS!H142,CALCULOS!J142))","v":{"$error":"#VALUE!"}}]
[null,61,0,0,null,6,{"$error":"#VALUE!"},{"$error":"#VALUE!"},{"$error":"#VALUE!"},{"$error":"#VALUE!"},{"$f":"IF(F143>$D$132,0,IF(INPUT!$C$13=\"Não\",CALCULOS!H143,CALCULOS!J143))","v":{"$error":"#VALUE!"}}]
[null,62,0,0,null,7,{"$error":"#VALUE!"},{"$error":"#VALUE!"},{"$error":"#VALUE!"},{"$error":"#VALUE!"},{"$f":"IF(F144>$D$132,0,IF(INPUT!$C$13=\"Não\",CALCULOS!H144,CALCULOS!J144))","v":{"$error":"#VALUE!"}}]
[null,63,0,0,null,8,{"$error":"#VALUE!"},{"$error":"#VALUE!"},{"$error":"#VALUE!"},{"$error":"#VALUE!"},{"$f":"IF(F145>$D$132,0,IF(INPUT!$C$13=\"Não\",CALCULOS!H145,CALCULOS!J145))","v":{"$error":"#VALUE!"}}]
[null,64,0,0,null,9,{"$error":"#VALUE!"},{"$error":"#VALUE!"},{"$error":"#VALUE!"},{"$error":"#VALUE!"},{"$f":"IF(F146>$D$132,0,IF(INPUT!$C$13=\"Não\",CALCULOS!H146,CALCULOS!J146))","v":{"$error":"#VALUE!"}}]
[null,65,0,0,null,10,{"$error":"#VALUE!"},{"$error":"#VALUE!"},{"$error":"#VALUE!"},{"$error":"#VALUE!"},{"$f":"IF(F147>$D$132,0,IF(INPUT!$C$13=\"Não\",CALCULOS!H147,CALCULOS!J147))","v":{"$error":"#VALUE!"}}]
[null,66,0,0,null,11,{"$error":"#VALUE!"},{"$error":"#VALUE!"},{"$error":"#VALUE!"},{"$error":"#VALUE!"},{"$f":"IF(F148>$D$132,0,IF(INPUT!$C$13=\"Não\",CALCULOS!H148,CALCULOS!J148))","v":{"$error":"#VALUE!"}}]
[null,67,0,0,null,12,{"$error":"#VALUE!"},{"$error":"#VALUE!"},{"$error":"#VALUE!"},{"$error":"#VALUE!"},{"$f":"IF(F149>$D$132,0,IF(INPUT!$C$13=\"Não\",CALCULOS!H149,CALCULOS!J149))","v":{"$error":"#VALUE!"}}]
[null,68,0,0,null,13,{"$error":"#VALUE!"},{"$error":"#VALUE!"},{"$error":"#VALUE!"},{"$error":"#VALUE!"},{"$f":"IF(F150>$D$132,0,IF(INPUT!$C$13=\"Não\",CALCULOS!H150,CALCULOS!J150))","v":{"$error":"#VALUE!"}}]
[null,69,0,0,null,14,{"$error":"#VALUE!"},{"$error":"#VALUE!"},{"$error":"#VALUE!"},{"$error":"#VALUE!"},{"$f":"IF(F151>$D$132,0,IF(INPUT!$C$13=\"Não\",CALCULOS!H151,CALCULOS!J151))","v":{"$error":"#VALUE!"}}]
[null,70,0,0,null,15,{"$error":"#VALUE!"},{"$error":"#VALUE!"},{"$error":"#VALUE!"},{"$error":"#VALUE!"},{"$f":"IF(F152>$D$132,0,IF(INPUT!$C$13=\"Não\",CALCULOS!H152,CALCULOS!J152))","v":{"$error":"#VALUE!"}}]
[null,71,0,0,null,16,{"$error":"#VALUE!"},{"$error":"#VALUE!"},{"$error":"#VALUE!"},{"$error":"#VALUE!"},{"$f":"IF(F153>$D$132,0,IF(INPUT!$C$13=\"Não\",CALCULOS!H153,CALCULOS!J153))","v":{"$error":"#VALUE!"}}]
[null,72,0,0,null,17,{"$error":"#VALUE!"},{"$f":"G154/(PAR_parcelas_ao_ano_benef*VLOOKUP($G$17,PAR_TAB_FATORES_ATUARIAIS,IF($C$25=\"M\",2,IF($C$25=\"F\",3,\"ERRO\")),0))","v":{"$error":"#VALUE!"}},{"$error":"#VALUE!"},{"$error":"#VALUE!"},{"$f":"IF(F154>$D$132,0,IF(INPUT!$C$13=\"Não\",CALCULOS!H154,CALCULOS!J154))","v":{"$error":"#VALUE!"}}]
[null,73,0,0,null,18,{"$error":"#VALUE!"},{"$error":"#VALUE!"},{"$error":"#VALUE!"},{"$error":"#VALUE!"},{"$f":"IF(F155>$D$132,0,IF(INPUT!$C$13=\"Não\",CALCULOS!H155,CALCULOS!J155))","v":{"$error":"#VALUE!"}}]
[null,74,0,0,null,19,{"$error":"#VALUE!"},{"$error":"#VALUE!"},{"$error":"#VALUE!"},{"$error":"#VALUE!"},{"$f":"IF(F156>$D$132,0,IF(INPUT!$C$13=\"Não\",CALCULOS!H156,CALCULOS!J156))","v":{"$error":"#VALUE!"}}]
[null,75,0,0,null,20,{"$error":"#VALUE!"},{"$error":"#VALUE!"},{"$error":"#VALUE!"},{"$error":"#VALUE!"},{"$f":"IF(F157>$D$132,0,IF(INPUT!$C$13=\"Não\",CALCULOS!H157,CALCULOS!J157))","v":{"$error":"#VALUE!"}}]
[null,76,{"$f":"IFERROR($C$59/(PAR_parcelas_ao_ano_benef*VLOOKUP(B158,PAR_TAB_FATORES_ATUARIAIS,IF($C$25=\"M\",2,IF($C$25=\"F\",3,\"ERRO\")),0)),0)","v":0},{"$f":"IFERROR($C$59/(PAR_parcelas_ao_ano_benef*VLOOKUP(B158,PAR_TAB_FATORES_ATUARIAIS,IF($C$25=\"M\",4,IF($C$25=\"F\",5,\"ERRO\")),0)),0)","v":0},null,21,{"$error":"#VALUE!"},{"$error":"#VALUE!"},{"$error":"#VALUE!"},{"$f":"I158/(PAR_parcelas_ao_ano_benef*VLOOKUP($G$17,PAR_TAB_FATORES_ATUARIAIS,IF($C$25=\"M\",4,IF($C$25=\"F\",5,\"ERRO\")),0))","v":{"$error":"#VALUE!"}},{"$f":"IF(F158>$D$132,0,IF(INPUT!$C$13=\"Não\",CALCULOS!H158,CALCULOS!J158))","v":{"$error":"#VALUE!"}}]
[null,77,0,0,null,22,{"$error":"#VALUE!"},{"$error":"#VALUE!"},{"$error":"#VALUE!"},{"$error":"#VALUE!"},{"$f":"IF(F159>$D$132,0,IF(INPUT!$C$13=\"Não\",CALCULOS!H159,CALCULOS!J159))","v":{"$error":"#VALUE!"}}]
[null,78,0,0,null,23,{"$error":"#VALUE!"},{"$error":"#VALUE!"},{"$error":"#VALUE!"},{"$error":"#VALUE!"},{"$f":"IF(F160>$D$132,0,IF(INPUT!$C$13=\"Não\",CALCULOS!H160,CALCULOS!J160))","v":{"$error":"#VALUE!"}}]
[null,79,0,0,null,24,{"$error":"#VALUE!"},{"$f":"G161/(PAR_parcelas_ao_ano_benef*VLOOKUP($G$17,PAR_TAB_FATORES_ATUARIAIS,IF($C$25=\"M\",2,IF($C$25=\"F\",3,\"ERRO\")),0))","v":{"$error":"#VALUE!"}},{"$error":"#VALUE!"},{"$error":"#VALUE!"},{"$f":"IF(F161>$D$132,0,IF(INPUT!$C$13=\"Não\",CALCULOS!H161,CALCULOS!J161))","v":{"$error":"#VALUE!"}}]
[null,80,0,0,null,25,{"$error":"#VALUE!"},{"$error":"#VALUE!"},{"$error":"#VALUE!"},{"$error":"#VALUE!"},{"$f":"IF(F162>$D$132,0,IF(INPUT!$C$13=\"Não\",CALCULOS!H162,CALCULOS!J162))","v":{"$error":"#VALUE!"}}]
[]
[null,"Simulação de renda vitalícia"]
[null,"Tipo","Renda Mensal"]
[null,"Aposentadoria sem reversão em Pensão",{"$f":"IFERROR($C$59/(PAR_parcelas_ao_ano_benef*VLOOKUP($G$17,PAR_TAB_FATORES_ATUARIAIS,IF($C$25=\"M\",2,IF($C$25=\"F\",3,\"ERRO\")),0)),0)","v":0}]
[null,"Aposentadoria com reversão em Pensão",{"$f":"IFERROR($C$59/(PAR_parcelas_ao_ano_benef*VLOOKUP($G$17,PAR_TAB_FATORES_ATUARIAIS,IF($C$25=\"M\",4,IF($C$25=\"F\",5,\"ERRO\")),0)),0)","v":0}]
[]
[]
[null,"Parcela Adicional de Risco"]
[null,"I. Contribuição Esperada",{"$f":"PAR_salario_partic","v":0}]
[null,"II. Multiplicador",{"$f":"13/12","v":1.0833333333333333}]
[null,"III. Tempo de serviço restante para periodo de carência ",{"$f":"IFERROR(DATEDIF(IN_dtSimul,C22,\"y\"),0)","v":0}]
[null,"IV. Fator Multiplicador",2]
[]
[null,"Parcela Adicional de Risco",{"$f":"C174*C173*C172*C171","v":0}]